Peptide,PTM,ModifiedAA,ModifiedPosition,PeptideUniqueToGene,ExperimentDesc,ExpID,PubmedID,ScoreType,IdentScore,LocProb,Log2FChange,PQ-val,QuantSig,PEP,MassErrorPPM
SEEAYEETQESSQSPRPVPK,ph,S,2,true,"atm and atr DNA damage response",88,25561503,"MASCOT Score",53.0000000,0.9950000,,,,,0.0600000
SEEAYEETQESSQSPRPVPK,ph,S,2,true,"Tissue atlas Arabidopsis - ProteomicsDB",114,32188942,"MaxQuant score",399.2200000,1.0000000,,,,0,
SEEAYEETQESSQSPR,ph,Y,6,true,"Tissue atlas Arabidopsis - ProteomicsDB",114,32188942,"MaxQuant score",94.3890000,0.9316280,,,,7.2490301761263E-8,
SEEAYEETQESSQSPRPVPK,ph,T,9,true,"Tissue atlas Arabidopsis - ProteomicsDB",114,32188942,"MaxQuant score",138.2800000,0.9999650,,,,4.4454201539331E-20,
SEEAYEETQESSQSPRPVPK,ph,S,13,true,"Tissue atlas Arabidopsis - ProteomicsDB",114,32188942,"MaxQuant score",308.1200000,0.9590670,,,,0,
SEEAYEETQESSQSPRPVPK,ph,S,15,true,"atm and atr DNA damage response",88,25561503,"MASCOT Score",73.0000000,0.9120000,,,,,0.1900000
SEEAYEETQESSQSPRPVPK,ph,S,15,true,"Protein sumoylation and phosphorylation cross-talk",97,28419593,,,,,,,,
SEEAYEETQESSQSPRPVPK,ph,S,15,true,"Tissue atlas Arabidopsis - ProteomicsDB",114,32188942,"MaxQuant score",534.7400000,0.9999780,,,,0,
LNERILSTLSR,ph,S,28,true,"Tissue atlas Arabidopsis - ProteomicsDB",114,32188942,"MaxQuant score",162.4900000,1.0000000,,,,0.0047986600548029,
ILSTLSRR,ph,S,28,true,"MAPK Arabidopsis substrates",45,23172892,"MaxQuant Score",78.5160000,,,,,,
ILSTLSR,ph,S,28,true,"srk2dei ABA signaling phopshoproteomics",83,23572148,"MASCOT Score",48.0000000,,,,,,0.0001000
ILSTLSR,ph,S,28,true,"TOR Kinase and ABA Receptor",100,29290610,XCorr,2.3802507,0.9946000,,,,0.0033489998895675,
LNERILSTLSR,ph,S,31,true,"Tissue atlas Arabidopsis - ProteomicsDB",114,32188942,"MaxQuant score",121.3600000,1.0000000,,,,0.0022561699151993,
VKYELDKK,ac,K,71,false,"Quantitative Acetylproteomics",101,29440448,,,,,,,,
RFFEDYKK,ac,K,177,false,"Quantitative Acetylproteomics",101,29440448,,,,,,,,
