Peptide,PTM,ModifiedAA,ModifiedPosition,PeptideUniqueToGene,ExperimentDesc,ExpID,PubmedID,ScoreType,IdentScore,LocProb,Log2FChange,PQ-val,QuantSig,PEP,MassErrorPPM
RRSPSPVYR,ph,S,183,true,"TOR Kinase and ABA Receptor",100,29290610,XCorr,3.0114286,1.0000000,,,,0.00012379999679979,
RSPSPVYR,ph,S,183,true,"atm and atr DNA damage response",88,25561503,"MASCOT Score",25.0000000,1.0000000,,,,,-0.6000000
RSPSPVYR,ph,S,183,true,"Phospho cell culture sucrose/TOR",109,30833711,,,0.9999960,,,,,
RRSPSPVYR,ph,S,185,true,"TOR Kinase and ABA Receptor",100,29290610,XCorr,3.0114286,0.9942000,,,,0.00012379999679979,
RSPSPVYR,ph,S,185,true,"atm and atr DNA damage response",88,25561503,"MASCOT Score",25.0000000,1.0000000,,,,,-0.6000000
RRPSPDYTR,ph,S,193,true,"STN8 phosphoproteome",38,21768351,"MASCOT Score",44.0300000,,,,,,-0.4895290
RRPSPDYTR,ph,S,193,true,"Tyrosine phosphorylation in Arabidopsis",59,18463617,"MASCOT Score",23.0000000,,,,,,-0.8968211
RRPSPDYTR,ph,S,193,true,"Chloroplast kinase substrates",60,19376835,"MASCOT Score",44.4300000,,,,,,-0.4895290
RRPSPDYTR,ph,S,193,true,"SnRK2 protein kinase substrates",85,23776212,XCorr,2.3530998,0.9510000,,,,0.014352899976075,
RRPSPDYTR,ph,S,193,true,"TOR Kinase and ABA Receptor",100,29290610,XCorr,2.5272386,1.0000000,,,,0.0001468999980716,
RRPSPDYTR,ph,S,193,true,"Phospho cell culture sucrose/TOR",109,30833711,,,0.9999920,,,,,
RRPSPDYTR,ph,S,193,true,"Col-0 callus - FC Col-0 vs. Col-0 Xray",111a,31410901,,36.0500000,,2.9710720,0.0000000,NO,,0.2392774
RRPSPDYTR,ph,S,193,true,"Col-0 X-ray callus - FC Col-0 vs. Col-0 Xray",111b,31410901,,36.0500000,,2.9710720,0.0000000,NO,,0.2392774
RRPSPDYTR,ph,S,193,true,"atm callus - FC atm vs. atm Xray",111c,31410901,,36.0500000,,-8.6072189,0.0000000,NO,,0.2392774
RRPSPDYTR,ph,S,193,true,"atm-3 X-ray callus - FC atm vs. atm Xray",111d,31410901,,36.0500000,,-8.6072189,0.0000000,NO,,0.2392774
RPSPDYTR,ph,S,193,true,"TOR Kinase and ABA Receptor",100,29290610,XCorr,2.4193277,0.9999000,,,,0.034770000725985,
RPSPDYTR,ph,S,193,true,"Col-0 callus - FC Col-0 vs. Col-0 Xray",111a,31410901,,38.0100000,,0.3211823,0.0000000,NO,,0.0263382
RPSPDYTR,ph,S,193,true,"Col-0 X-ray callus - FC Col-0 vs. Col-0 Xray",111b,31410901,,38.0100000,,0.3211823,0.0000000,NO,,0.0263382
RPSPDYTR,ph,S,193,true,"atm callus - FC atm vs. atm Xray",111c,31410901,,38.0100000,,-2.7681666,0.0000000,NO,,0.0263382
RPSPDYTR,ph,S,193,true,"atm-3 X-ray callus - FC atm vs. atm Xray",111d,31410901,,38.0100000,,-2.7681666,0.0000000,NO,,0.0263382
RPSPDYTR,ph,S,193,true,"Tissue atlas Arabidopsis - ProteomicsDB",114,32188942,"MaxQuant score",117.4500000,1.0000000,,,,0.00044231899664737,
RRSPEYDR,ph,S,201,true,"Tyrosine phosphorylation in Arabidopsis",59,18463617,"MASCOT Score",27.0000000,,,,,,-1.9006549
RRSPEYDR,ph,S,201,true,"TOR Kinase and ABA Receptor",100,29290610,XCorr,2.7210820,1.0000000,,,,0.011040000244975,
SPEYDRYK,ph,S,201,false,"Tissue atlas Arabidopsis - ProteomicsDB",114,32188942,"MaxQuant score",116.1300000,1.0000000,,,,0.0038901900406927,
SPGYDRSRSPIQR,ph,S,235,true,"Tissue atlas Arabidopsis - ProteomicsDB",114,32188942,"MaxQuant score",68.4110000,0.9999340,,,,0.0028835900593549,
ARSPGYDR,ph,S,235,true,"Chloroplast kinase substrates",60,19376835,"MASCOT Score",36.6100000,,,,,,0.0554829
ARSPGYDR,ph,S,235,true,"SnRK2 protein kinase substrates",85,23776212,XCorr,2.3896146,1.0000000,,,,0.19525399804115,
ARSPGYDR,ph,S,235,true,"atm and atr DNA damage response",88,25561503,"MASCOT Score",25.0000000,1.0000000,,,,,0.2600000
SPGYDR,ph,S,235,false,"STN8 phosphoproteome",38,21768351,"MASCOT Score",36.5600000,,,,,,-0.5280380
SPGYDRSRSPIQR,ph,S,241,true,"Tissue atlas Arabidopsis - ProteomicsDB",114,32188942,"MaxQuant score",68.4110000,0.9987570,,,,0.0028835900593549,
SPGYDRSRSPIQR,ph,S,243,true,"Tissue atlas Arabidopsis - ProteomicsDB",114,32188942,"MaxQuant score",68.4110000,0.9997070,,,,0.0028835900593549,
