Peptide,PTM,ModifiedAA,ModifiedPosition,PeptideUniqueToGene,ExperimentDesc,ExpID,PubmedID,ScoreType,IdentScore,LocProb,Log2FChange,PQ-val,QuantSig,PEP,MassErrorPPM
FLLLSVWMK,ph,S,631,true,"srk2dei ABA signaling phopshoproteomics",83,23572148,"MASCOT Score",21.0000000,,,,,,-0.0005000
DSEFLSDSGTNDINEADTTSTSR,ph,S,947,true,"atm and atr DNA damage response",88,25561503,"MASCOT Score",72.0000000,0.9940000,,,,,0.3100000
DSEFLSDSGTNDINEADTTSTSR,ph,S,947,true,"Tissue atlas Arabidopsis - ProteomicsDB",114,32188942,"MaxQuant score",362.2400000,0.9999710,,,,0,
SVLCPDILLSK,sno,C,1061,true,"hot5-4 / wildtype, FAT-switch S-nitrosoproteome",169,37277371,,,,,,,,
LCLGSSVEDLK,sno,C,1709,true,"hot5-4 / wildtype, FAT-switch S-nitrosoproteome",169,37277371,,,,-0.0682962,0.6081345,NO,,
SSNEVASLANHASNSSPK,ph,S,2008,true,"Tissue atlas Arabidopsis - ProteomicsDB",114,32188942,"MaxQuant score",123.4300000,0.8540480,,,,1.0729999923515E-13,
SSNEVASLANHASNSSPK,ph,S,2023,true,"atm and atr DNA damage response",88,25561503,"MASCOT Score",50.0000000,0.9320000,,,,,-0.0800000
SSNEVASLANHASNSSPK,ph,S,2023,true,"TOR Kinase and ABA Receptor",100,29290610,XCorr,4.4437718,0.9819000,,,,1.1500000027809E-6,
SSNEVASLANHASNSSPK,ph,S,2023,true,"Tissue atlas Arabidopsis - ProteomicsDB",114,32188942,"MaxQuant score",309.2300000,0.9665810,,,,0,
