Peptide,PTM,ModifiedAA,ModifiedPosition,PeptideUniqueToGene,ExperimentDesc,ExpID,PubmedID,ScoreType,IdentScore,LocProb,Log2FChange,PQ-val,QuantSig,PEP,MassErrorPPM
IVQGSNNTNVDSPR,ph,S,97,true,"atm and atr DNA damage response",88,25561503,"MASCOT Score",72.0000000,1.0000000,,,,,-1.1600000
IVQGSNNTNVDSPR,ph,S,97,true,"TOR Kinase and ABA Receptor",100,29290610,XCorr,3.5088906,0.9994000,,,,0.0038209999911487,
IVQGSNNTNVDSPR,ph,S,97,true,"Lateral root-induction - NAA vs control",106,23328941,"MASCOT Score",37.0000000,,,,,,
IVQGSNNTNVDSPR,ph,S,97,true,"Tissue atlas Arabidopsis - ProteomicsDB",114,32188942,"MaxQuant score",260.5600000,1.0000000,,,,0,
RSDQNLEAFSER,ph,S,158,true,"atm and atr DNA damage response",88,25561503,"MASCOT Score",54.0000000,1.0000000,,,,,-0.0200000
RSDQNLEAFSER,ph,S,158,true,"Tissue atlas Arabidopsis - ProteomicsDB",114,32188942,"MaxQuant score",106.2800000,1.0000000,,,,6.3895800849423E-5,
SDQNLEAFSER,ph,S,158,true,"atm and atr DNA damage response",88,25561503,"MASCOT Score",32.0000000,1.0000000,,,,,0.5000000
KLDISKSPTPHDVLPLK,ph,S,242,true,"Tissue atlas Arabidopsis - ProteomicsDB",114,32188942,"MaxQuant score",142.3200000,0.8010370,,,,1.9057899789537E-12,
SPTPHDVLPLKSSPK,ph,S,253,true,"Tissue atlas Arabidopsis - ProteomicsDB",114,32188942,"MaxQuant score",219.9500000,0.8580070,,,,0,
SPTPHDVLPLKSSPK,ph,S,254,true,"Tissue atlas Arabidopsis - ProteomicsDB",114,32188942,"MaxQuant score",219.9500000,0.7950260,,,,0,
NDLESDVDEDLNR,ph,S,343,true,"Tissue atlas Arabidopsis - ProteomicsDB",114,32188942,"MaxQuant score",268.1800000,1.0000000,,,,0,
KMDLHLNSPGNQLQATSTGRPFK,ph,S,377,true,"Tissue atlas Arabidopsis - ProteomicsDB",114,32188942,"MaxQuant score",47.5370000,0.9999100,,,,0.00081235799007118,
DRCSENQNENQDMSTK,ph,S,666,true,"Tissue atlas Arabidopsis - ProteomicsDB",114,32188942,"MaxQuant score",64.5220000,0.9999990,,,,0.00019870999676641,
FEGLCK,ox,C,693,false,"OxiTRAQ Arabidopsis - 5 mM H2O2 versus control",47,24376095,,,,-0.0869923,0.0725369,NO,,
FEGLCK,sno,C,693,false,"hot5-4 / wildtype, FAT-switch S-nitrosoproteome",169,37277371,,,,1.1031089,0.0012645,YES,,
FEGLCK,so,C,693,false,"Arabidopsis S-sulfenylation chemoproteomics",108,31578252,"pFind PSM Score",0.1453990,,0.9664000,,,,0.2793421
FEGLCK,so,C,693,false,"S-sulfenylation site detection using YAP1C",110,32714340,,,,,,,,
SNMLVAANSTGNMKLLK,ph,S,1019,true,"Phosphorylation in N starvation",63,22060019,"MASCOT Score",21.0000000,,,,,,1.1717600
