Peptide,PTM,ModifiedAA,ModifiedPosition,PeptideUniqueToGene,ExperimentDesc,ExpID,PubmedID,ScoreType,IdentScore,LocProb,Log2FChange,PQ-val,QuantSig,PEP,MassErrorPPM
GNSSEEPKPPTK,ph,S,4,true,"Col-0 callus - FC Col-0 vs. Col-0 Xray",111a,31410901,,27.9500000,,2.4259934,0.0000000,NO,,0.2029406
GNSSEEPKPPTK,ph,S,4,true,"Col-0 X-ray callus - FC Col-0 vs. Col-0 Xray",111b,31410901,,27.9500000,,2.4259934,0.0000000,NO,,0.2029406
GNSSEEPKPPTK,ph,S,4,true,"atm callus - FC atm vs. atm Xray",111c,31410901,,27.9500000,,-2.9508543,0.0000000,NO,,0.2029406
GNSSEEPKPPTK,ph,S,4,true,"atm-3 X-ray callus - FC atm vs. atm Xray",111d,31410901,,27.9500000,,-2.9508543,0.0000000,NO,,0.2029406
GNSSEEPKPPTK,ph,S,4,true,"Tissue atlas Arabidopsis - ProteomicsDB",114,32188942,"MaxQuant score",233.4300000,0.9937090,,,,0,
SDKPSSPPVDQTNVHVYPDWAAMQAYYGPR,ph,S,19,true,"Tissue atlas Arabidopsis - ProteomicsDB",114,32188942,"MaxQuant score",261.2500000,0.9774770,,,,0,
STGNTDNGLMK,ph,S,124,true,"Tissue atlas Arabidopsis - ProteomicsDB",114,32188942,"MaxQuant score",135.0800000,0.9659660,,,,7.1002801860232E-7,
SREGTPTKDGK,ph,S,189,true,"Tissue atlas Arabidopsis - ProteomicsDB",114,32188942,"MaxQuant score",76.3110000,0.9234570,,,,0.00059570197481662,
QLVQASSFHSVSPSSGDTGVK,ph,S,206,true,"Tissue atlas Arabidopsis - ProteomicsDB",114,32188942,"MaxQuant score",123.4400000,0.8641890,,,,2.6876800025958E-18,
QLVQASSFHSVSPSSGDTGVK,ph,S,209,true,"Tissue atlas Arabidopsis - ProteomicsDB",114,32188942,"MaxQuant score",281.5800000,0.9945940,,,,0,
QLVQASSFHSVSPSSGDTGVK,ph,S,211,true,"Col-0 callus - FC Col-0 vs. Col-0 Xray",111a,31410901,,22.1900000,,-0.3497936,0.0000000,NO,,2.2876881
QLVQASSFHSVSPSSGDTGVK,ph,S,211,true,"Col-0 X-ray callus - FC Col-0 vs. Col-0 Xray",111b,31410901,,22.1900000,,-0.3497936,0.0000000,NO,,2.2876881
QLVQASSFHSVSPSSGDTGVK,ph,S,211,true,"atm callus - FC atm vs. atm Xray",111c,31410901,,22.1900000,,1.0229812,0.0000000,NO,,2.2876881
QLVQASSFHSVSPSSGDTGVK,ph,S,211,true,"atm-3 X-ray callus - FC atm vs. atm Xray",111d,31410901,,22.1900000,,1.0229812,0.0000000,NO,,2.2876881
QLVQASSFHSVSPSSGDTGVK,ph,S,211,true,"Tissue atlas Arabidopsis - ProteomicsDB",114,32188942,"MaxQuant score",314.7900000,0.9999650,,,,0,
QLVQASSFHSVSPSSGDTGVK,ph,S,214,true,"Tissue atlas Arabidopsis - ProteomicsDB",114,32188942,"MaxQuant score",172.3700000,0.8897360,,,,3.5115300095514E-36,
