Peptide,PTM,ModifiedAA,ModifiedPosition,PeptideUniqueToGene,ExperimentDesc,ExpID,PubmedID,ScoreType,IdentScore,LocProb,Log2FChange,PQ-val,QuantSig,PEP,MassErrorPPM
RVHFSPLR,ph,S,152,true,"TOR Kinase and ABA Receptor",100,29290610,XCorr,2.7069128,1.0000000,,,,0.030999999493361,
VHFSPLRR,ph,S,152,true,"Tissue atlas Arabidopsis - ProteomicsDB",114,32188942,"MaxQuant score",91.5490000,1.0000000,,,,0.0012920500012115,
RTDTRQNHYQAISR,ph,T,159,true,"TOR Kinase and ABA Receptor",100,29290610,XCorr,3.0190282,0.8634000,,,,0.0030590000096709,
TDTRQNHYQAISR,ph,T,159,true,"atm and atr DNA damage response",88,25561503,"MASCOT Score",39.0000000,1.0000000,,,,,-0.7600000
TDTRQNHYQAISR,ph,T,159,true,"TOR Kinase and ABA Receptor",100,29290610,XCorr,2.4099200,0.8767000,,,,0.00079530000220984,
TDTRQNHYQAISR,ph,T,159,true,"Tissue atlas Arabidopsis - ProteomicsDB",114,32188942,"MaxQuant score",114.0600000,0.9964310,,,,4.5950400817674E-5,
SLSWHLGSETK,ph,S,182,true,"Tissue atlas Arabidopsis - ProteomicsDB",114,32188942,"MaxQuant score",195.0900000,0.9999920,,,,1.8241598981673E-18,
LLTAHRSLDNNPR,ph,S,260,true,"TOR Kinase and ABA Receptor",100,29290610,XCorr,2.7804492,1.0000000,,,,0.0035089999437332,
TKSVLSAFFVK,ph,S,278,true,"Tissue atlas Arabidopsis - ProteomicsDB",114,32188942,"MaxQuant score",186.6900000,0.9999930,,,,2.9098498919656E-14,
SVLSAFFVK,ph,S,278,true,"TOR Kinase and ABA Receptor",100,29290610,XCorr,2.8818097,1.0000000,,,,0.0039550000801682,
