Peptide,PTM,ModifiedAA,ModifiedPosition,PeptideUniqueToGene,ExperimentDesc,ExpID,PubmedID,ScoreType,IdentScore,LocProb,Log2FChange,PQ-val,QuantSig,PEP,MassErrorPPM
SLDANRSPESVNPESTGFEK,ph,S,27,true,"TOR Kinase and ABA Receptor",100,29290610,XCorr,3.4847698,0.9722000,,,,0.00010530000145081,
SLDANRSPESVNPESTGFEK,ph,S,27,true,"Tissue atlas Arabidopsis - ProteomicsDB",114,32188942,"MaxQuant score",144.4300000,0.9995690,,,,9.3017200464206E-24,
ITPHDIDSDTDQIFLR,ph,S,526,true,"Large-scale phosphorylation discovery",44,23111157,XCorr,3.9360000,,,,,,
ITPHDIDSDTDQIFLR,ph,S,526,true,"Tyrosine phosphorylation in Arabidopsis",59,18463617,"MASCOT Score",64.0000000,,,,,,-1.0687643
ITPHDIDSDTDQIFLR,ph,S,526,true,"SnRK2 protein kinase substrates",85,23776212,XCorr,2.8724985,0.9960000,,,,3.96250006599E-16,
ITPHDIDSDTDQIFLR,ph,S,526,true,"TOR Kinase and ABA Receptor",100,29290610,XCorr,4.6403017,0.9063000,,,,0.0011340000201017,
ITPHDIDSDTDQIFLR,ph,S,526,true,"Lateral root-induction - NAA vs control",106,23328941,"MASCOT Score",38.0000000,,,,,,
ITPHDIDSDTDQIFLR,ph,S,526,true,"Phospho cell culture sucrose/TOR",109,30833711,,,0.9841690,,,,,
ITPHDIDSDTDQIFLR,ph,S,526,true,"Tissue atlas Arabidopsis - ProteomicsDB",114,32188942,"MaxQuant score",244.8800000,0.9934440,,,,0,
ATENENPAPEANTFQKPALLSPNK,ph,S,555,true,"Tissue atlas Arabidopsis - ProteomicsDB",114,32188942,"MaxQuant score",125.8500000,0.9909670,,,,2.8618199756036E-34,
