Peptide,PTM,ModifiedAA,ModifiedPosition,PeptideUniqueToGene,ExperimentDesc,ExpID,PubmedID,ScoreType,IdentScore,LocProb,Log2FChange,PQ-val,QuantSig,PEP,MassErrorPPM
ALVSPIPAMGERAGSMR,ph,S,5,true,"srk2dei ABA signaling phopshoproteomics",83,23572148,"MASCOT Score",24.0000000,,,,,,-0.0007000
FHGIGSPGSR,ph,S,24,true,"atm and atr DNA damage response",88,25561503,"MASCOT Score",40.0000000,1.0000000,,,,,0.5400000
FHGIGSPGSR,ph,S,24,true,"TOR Kinase and ABA Receptor",100,29290610,XCorr,2.5261095,0.9984000,,,,0.0031179999932647,
FHGIGSPGSR,ph,S,24,true,"Phospho cell culture sucrose/TOR",109,30833711,,,0.9777980,,,,,
FHGIGSPGSR,ph,S,24,true,"Tissue atlas Arabidopsis - ProteomicsDB",114,32188942,"MaxQuant score",139.2900000,0.9999440,,,,7.6884198279004E-6,
FHGIGSPGSR,ph,S,27,true,"Col-0 callus - FC Col-0 vs. Col-0 Xray",111a,31410901,,22.5800000,,0.0765462,0.0000000,NO,,0.0966420
FHGIGSPGSR,ph,S,27,true,"Col-0 X-ray callus - FC Col-0 vs. Col-0 Xray",111b,31410901,,22.5800000,,0.0765462,0.0000000,NO,,0.0966420
FHGIGSPGSR,ph,S,27,true,"atm callus - FC atm vs. atm Xray",111c,31410901,,22.5800000,,0.1572042,0.0000000,NO,,0.0966420
FHGIGSPGSR,ph,S,27,true,"atm-3 X-ray callus - FC atm vs. atm Xray",111d,31410901,,22.5800000,,0.1572042,0.0000000,NO,,0.0966420
SSRSGIMDEPVSR,ph,S,29,true,"atm and atr DNA damage response",88,25561503,"MASCOT Score",32.0000000,0.9560000,,,,,-0.1000000
SSRSGIMDEPVSR,ph,S,32,true,"atm and atr DNA damage response",88,25561503,"MASCOT Score",32.0000000,1.0000000,,,,,-0.1000000
SGIMDEPVSR,ph,S,32,true,"atm and atr DNA damage response",88,25561503,"MASCOT Score",46.0000000,1.0000000,,,,,-0.5900000
SGIMDEPVSR,ph,S,32,true,"Tissue atlas Arabidopsis - ProteomicsDB",114,32188942,"MaxQuant score",94.5380000,1.0000000,,,,0.00034057899028994,
VQSTDSVQQLVSNGSSTEQSGR,ph,S,247,true,"Tissue atlas Arabidopsis - ProteomicsDB",114,32188942,"MaxQuant score",269.4400000,0.9957450,,,,0,
ASSGGSSSFHLGR,ph,S,752,true,"atm and atr DNA damage response",88,25561503,"MASCOT Score",58.0000000,1.0000000,,,,,-0.1200000
ASSGGSSSFHLGR,ph,S,752,true,"Phospho cell culture sucrose/TOR",109,30833711,,,0.9372520,,,,,
ASSGGSSSFHLGR,ph,S,752,true,"Tissue atlas Arabidopsis - ProteomicsDB",114,32188942,"MaxQuant score",203.1100000,0.9658590,,,,1.0769799859236E-38,
