Peptide,PTM,ModifiedAA,ModifiedPosition,PeptideUniqueToGene,ExperimentDesc,ExpID,PubmedID,ScoreType,IdentScore,LocProb,Log2FChange,PQ-val,QuantSig,PEP,MassErrorPPM
ADGGAEPPAPPSSINAGEF,nta,A,2,true,"Arabidopsis translation initiation landscape - NTA",167a,35069635,,,,,,,,
ADGGAEPPAPPSSINAGE,nta,A,2,true,"HUNTER N-terminome: legumain, GluC and trypsin",119,31951383,"MaxQuant score",97.8600000,,,,,,
LVFGSFSGDATQSLNGLHNGNLK,ph,S,159,true,"Tissue atlas Arabidopsis - ProteomicsDB",114,32188942,"MaxQuant score",92.8190000,0.9424410,,,,3.0936900263789E-10,
GLKSTPPPPPPGFSSNQR,ph,T,237,true,"Tissue atlas Arabidopsis - ProteomicsDB",114,32188942,"MaxQuant score",86.1820000,0.8183250,,,,2.3604299713043E-5,
LRGLSIQNESK,me1,R,294,true,"Arabidopsis protein methylome",123,31809900,"MaxQuant Score",73.4350000,1.0000000,,,,0.00052769499598071,-0.0147440
GLSIQNESK,ph,S,297,true,"Tissue atlas Arabidopsis - ProteomicsDB",114,32188942,"MaxQuant score",112.9400000,0.9999990,,,,0.00045419699745253,
FNLSQQIDHPGPPK,ph,S,307,true,"Tissue atlas Arabidopsis - ProteomicsDB",114,32188942,"MaxQuant score",56.2150000,1.0000000,,,,0.0018216599710286,
REELGQLSK,ph,S,354,true,"atm and atr DNA damage response",88,25561503,"MASCOT Score",39.0000000,1.0000000,,,,,-2.6600000
REGNANSDEIEDFGEDIVK,ph,S,364,true,"TOR Kinase and ABA Receptor",100,29290610,XCorr,4.4416943,1.0000000,,,,6.2389997765422E-5,
EGNANSDEIEDFGEDIVK,ph,S,364,true,"Tissue atlas Arabidopsis - ProteomicsDB",114,32188942,"MaxQuant score",187.3900000,1.0000000,,,,4.9223000856147E-36,
HLICIEDPFETSHDLGR,sno,C,705,true,"Site-specific nitrosomeproteomic id - gsnor1-3",90b,25699590,XCorr,2.5700000,,,,,0.057599999010563,-3.4600000
IMHQDPNPCAK,so,C,746,true,"Arabidopsis S-sulfenylation chemoproteomics",108,31578252,"pFind PSM Score",0.0309702,,,,,,-1.4918900
