Peptide,PTM,ModifiedAA,ModifiedPosition,PeptideUniqueToGene,ExperimentDesc,ExpID,PubmedID,ScoreType,IdentScore,LocProb,Log2FChange,PQ-val,QuantSig,PEP,MassErrorPPM
MEDDDERKLPEADIANPLHNR,nta,M,1,true,"Arabidopsis translation initiation landscape - NTA",167a,35069635,,,,,,,,
IEAFDTTLQGISSADR,ph,S,33,true,"Tissue atlas Arabidopsis - ProteomicsDB",114,32188942,"MaxQuant score",255.4900000,0.7878800,,,,0,
IEAFDTTLQGISSADR,ph,S,34,true,"Tissue atlas Arabidopsis - ProteomicsDB",114,32188942,"MaxQuant score",271.2700000,0.9214400,,,,0,
AFKDDDFEQVSLGDQEK,ph,S,48,true,"STN8 phosphoproteome",38,21768351,"MASCOT Score",57.9500000,,,,,,-1.5309800
AFKDDDFEQVSLGDQEK,ph,S,48,true,"Chloroplast kinase substrates",60,19376835,"MASCOT Score",51.1300000,,,,,,-2.4516400
AFKDDDFEQVSLGDQEK,ph,S,48,true,"LAXIC - mannitol vs control",84b,23660473,XCorr,3.7400000,1.0000000,,,,1.5100000382517E-5,
AFKDDDFEQVSLGDQEK,ph,S,48,true,"SnRK2 protein kinase substrates",85,23776212,XCorr,3.6086380,1.0000000,,,,1.7833700738379E-8,
AFKDDDFEQVSLGDQEK,ph,S,48,true,"atm and atr DNA damage response",88,25561503,"MASCOT Score",74.0000000,1.0000000,,,,,-1.8800000
AFKDDDFEQVSLGDQEK,ph,S,48,true,"Touch-induced phosphorylation: 40s touch vs untouc",136,30291188,"MASCOT score",100.7200000,,-0.0440780,0.7144638,NO,,-0.7624517
DDDFEQVSLGDQEK,ph,S,48,true,"atm and atr DNA damage response",88,25561503,"MASCOT Score",39.0000000,1.0000000,,,,,0.4900000
DDDFEQVSLGDQEK,ph,S,48,true,"TOR Kinase and ABA Receptor",100,29290610,XCorr,3.9221284,1.0000000,,,,7.437000022037E-5,
DDDFEQVSLGDQEK,ph,S,48,true,"Phospho cell culture sucrose/TOR",109,30833711,,,1.0000000,,,,,
DDDFEQVSLGDQEK,ph,S,48,true,"Tissue atlas Arabidopsis - ProteomicsDB",114,32188942,"MaxQuant score",290.8800000,1.0000000,,,,0,
AANESQGDLQEPGSFSNSDHGR,ph,S,59,true,"atm and atr DNA damage response",88,25561503,"MASCOT Score",58.0000000,1.0000000,,,,,-0.9000000
AANESQGDLQEPGSFSNSDHGR,ph,S,59,true,"Tissue atlas Arabidopsis - ProteomicsDB",114,32188942,"MaxQuant score",232.0000000,1.0000000,,,,0,
AANESQGDLQEPGSFSNSDHGR,ph,S,68,true,"Tissue atlas Arabidopsis - ProteomicsDB",114,32188942,"MaxQuant score",252.5500000,0.9950890,,,,0,
AANESQGDLQEPGSFSNSDHGR,ph,S,70,true,"Tissue atlas Arabidopsis - ProteomicsDB",114,32188942,"MaxQuant score",325.0300000,0.9389370,,,,0,
AANESQGDLQEPGSFSNSDHGR,ph,S,72,true,"SnRK2 protein kinase substrates",85,23776212,XCorr,2.7996440,0.9490000,,,,1.5963800251484E-5,
AANESQGDLQEPGSFSNSDHGR,ph,S,72,true,"atm and atr DNA damage response",88,25561503,"MASCOT Score",56.0000000,0.9280000,,,,,-0.3900000
AANESQGDLQEPGSFSNSDHGR,ph,S,72,true,"Tissue atlas Arabidopsis - ProteomicsDB",114,32188942,"MaxQuant score",347.2800000,0.9973650,,,,0,
LSSPGPER,ph,S,111,true,"Chloroplast kinase substrates",60,19376835,"MASCOT Score",52.9400000,,,,,,-1.2295500
LSSPGPER,ph,S,111,true,"atm and atr DNA damage response",88,25561503,"MASCOT Score",32.0000000,0.9970000,,,,,-1.7600000
LSSPGPER,ph,S,111,true,"Lateral root-induction - NAA vs control",106,23328941,"MASCOT Score",26.0000000,,,,,,
LSSPGPER,ph,S,111,true,"Phospho cell culture sucrose/TOR",109,30833711,,,0.9999620,,,,,
LSSPGPER,ph,S,111,true,"Tissue atlas Arabidopsis - ProteomicsDB",114,32188942,"MaxQuant score",119.7500000,0.9999950,,,,0.002974719973281,
EAAYSMQQSLSETSLDSVHHPESGYSPVHSPQKPK,ph,S,127,true,"Tissue atlas Arabidopsis - ProteomicsDB",114,32188942,"MaxQuant score",96.3160000,0.7807460,,,,3.4866599971537E-28,
EAAYSMQQSLSETSLDSVHHPESGYSPVHSPQKPKPK,ph,S,146,true,"Tissue atlas Arabidopsis - ProteomicsDB",114,32188942,"MaxQuant score",260.7400000,0.9828580,,,,0,
ISKPLSFCCIGTNPPPTMAGLQR,ub,K,535,true,"Arabidopsis ubiquitination by TUBEs",2,23667124,,,,,,,,
FCPDASLSGAAGTLR,sno,C,642,true,"Site-specific nitrosomeproteomic id - gsnor1-3",90a,25699590,XCorr,2.1999815,,,,,0.0094630001112819,-3.8967020
FCPDASLSGAAGTLR,sno,C,642,true,"Site-specific nitrosomeproteomic id - gsnor1-3",90b,25699590,XCorr,2.7100000,,,,,0.00010869999823626,-6.7600000
IMSVAIQHPGNNEELCR,sno,C,738,true,"hot5-4 / wildtype, FAT-switch S-nitrosoproteome",169,37277371,,,,,,,,
RSSTDPSEK,ph,S,975,true,"atm and atr DNA damage response",88,25561503,"MASCOT Score",21.0000000,0.9880000,,,,,-0.3000000
RSSTDPSEKSPYNESGSVK,ph,S,982,true,"Tissue atlas Arabidopsis - ProteomicsDB",114,32188942,"MaxQuant score",112.5500000,0.9970440,,,,2.4125299535882E-9,
SPYNESGSVK,ph,S,989,true,"atm and atr DNA damage response",88,25561503,"MASCOT Score",60.0000000,0.9970000,,,,,-0.8800000
SPYNESGSVK,ph,S,989,true,"Tissue atlas Arabidopsis - ProteomicsDB",114,32188942,"MaxQuant score",131.1700000,0.8352140,,,,2.6545199943939E-5,
AAAGVAAEGLAPK,nta,A,1343,true,"Arabidopsis translation initiation landscape - NTA",167a,35069635,,,,,,,,
QTCATNAVASPSPLK,sno,C,1394,true,"hot5-4 / wildtype, FAT-switch S-nitrosoproteome",169,37277371,,,,-0.4383457,0.1286403,NO,,
QTCATNAVASPSPLK,ph,S,1401,true,"STN8 phosphoproteome",38,21768351,"MASCOT Score",64.0600000,,,,,,
QTCATNAVASPSPLK,ph,S,1401,true,"srk2dei ABA signaling phopshoproteomics",83,23572148,"MASCOT Score",40.0000000,,,,,,-0.0005000
QTCATNAVASPSPLK,ph,S,1401,true,"SnRK2 protein kinase substrates",85,23776212,XCorr,2.7830105,0.9940000,,,,4.283989983378E-5,
QTCATNAVASPSPLK,ph,S,1401,true,"TOR Kinase and ABA Receptor",100,29290610,XCorr,4.8006659,0.9164000,,,,1.0069999945017E-7,
QTCATNAVASPSPLK,ph,S,1401,true,"Lateral root-induction - NAA vs control",106,23328941,"MASCOT Score",24.0000000,,,,,,
QTCATNAVASPSPLK,ph,S,1401,true,"Tissue atlas Arabidopsis - ProteomicsDB",114,32188942,"MaxQuant score",347.0900000,1.0000000,,,,0,
QTCATNAVASPSPLK,ph,S,1403,true,"Tissue atlas Arabidopsis - ProteomicsDB",114,32188942,"MaxQuant score",265.7300000,1.0000000,,,,0,
RTSTLTAIGESSEISSSR,ph,T,1409,true,"Tissue atlas Arabidopsis - ProteomicsDB",114,32188942,"MaxQuant score",147.5200000,0.7684750,,,,4.553089950345E-18,
TSTLTAIGESSEISSSR,ph,T,1409,true,"Large-scale phosphorylation discovery",44,23111157,XCorr,4.7380000,,,,,,
RTSTLTAIGESSEISSSR,ph,S,1410,true,"TOR Kinase and ABA Receptor",100,29290610,XCorr,4.9188490,0.7691000,,,,3.2709998777136E-5,
RTSTLTAIGESSEISSSR,ph,S,1410,true,"Tissue atlas Arabidopsis - ProteomicsDB",114,32188942,"MaxQuant score",147.5200000,0.9569340,,,,4.553089950345E-18,
RTSTLTAIGESSEISSSR,ph,T,1411,true,"atm and atr DNA damage response",88,25561503,"MASCOT Score",80.0000000,0.9480000,,,,,0.0300000
TSTLTAIGESSEISSSR,ph,T,1411,true,"Tissue atlas Arabidopsis - ProteomicsDB",114,32188942,"MaxQuant score",203.5300000,0.9978040,,,,0,
ASLSSDSGKVPLDILASMADSSGQISAVAMER,ph,S,1427,true,"Large-scale phosphorylation discovery",44,23111157,XCorr,4.3170000,,,,,,
ASLSSDSGK,ph,S,1427,true,"atm and atr DNA damage response",88,25561503,"MASCOT Score",60.0000000,1.0000000,,,,,-1.2200000
ASLSSDSGKVPLDILASMADSSGQISAVAMER,ph,S,1432,true,"Large-scale phosphorylation discovery",44,23111157,XCorr,5.1340000,,,,,,
SSGNSVTLDSGSQMSMR,ph,S,1613,true,"atm and atr DNA damage response",88,25561503,"MASCOT Score",27.0000000,0.9900000,,,,,-0.4900000
SSGNSVTLDSGSQMSMR,ph,S,1617,true,"Tissue atlas Arabidopsis - ProteomicsDB",114,32188942,"MaxQuant score",115.6600000,0.9071690,,,,4.1874201883729E-9,
SSGNSVTLDSGSQMSMR,ph,S,1624,true,"Tissue atlas Arabidopsis - ProteomicsDB",114,32188942,"MaxQuant score",133.3200000,0.9176090,,,,1.3631899775657E-10,
RDSSMLER,ph,S,1779,true,"atm and atr DNA damage response",88,25561503,"MASCOT Score",33.0000000,1.0000000,,,,,-0.7200000
RDSSMLER,ph,S,1779,true,"TOR Kinase and ABA Receptor",100,29290610,XCorr,3.1695492,0.9145000,,,,0.051150001585484,
RDSSMLER,ph,S,1779,true,"Tissue atlas Arabidopsis - ProteomicsDB",114,32188942,"MaxQuant score",81.6760000,1.0000000,,,,0.0065988698042929,
RDSSMLER,ph,S,1780,true,"atm and atr DNA damage response",88,25561503,"MASCOT Score",39.0000000,0.9400000,,,,,-0.1200000
RDSSMLER,ph,S,1780,true,"Tissue atlas Arabidopsis - ProteomicsDB",114,32188942,"MaxQuant score",107.1000000,1.0000000,,,,0.010522999800742,
DSSMLER,ph,S,1780,true,"TOR Kinase and ABA Receptor",100,29290610,XCorr,2.6604869,0.9937000,,,,0.00096360000316054,
DSSMLER,ph,S,1780,true,"Phospho cell culture sucrose/TOR",109,30833711,,,0.9999110,,,,,
LQTFSSFQK,ph,S,1793,false,"atm and atr DNA damage response",88,25561503,"MASCOT Score",41.0000000,0.9550000,,,,,-1.0100000
LQTFSSFQKPLEPPNNNAPPRPR,ph,S,1794,true,"Arabidopsis root NAA phosphoproteome",18a,27643528,"MaxQuant Score",81.9740000,0.7900000,,,,2.0499999919821E-8,-0.1190000
LQTFSSFQKPLEPPNNNAPPRPR,ph,S,1794,true,"Large-scale phosphorylation discovery",44,23111157,XCorr,3.4950000,,,,,,
LQTFSSFQKPLEPPNNNAPPRPR,ph,S,1794,true,"PAMP-triggered phosphorylation",48,24601666,"MASCOT Score",41.7000000,,,,,,
LQTFSSFQKPLEPPNNNAPPRPR,ph,S,1794,true,"Chloroplast kinase substrates",60,19376835,"MASCOT Score",34.7600000,,,,,,-1.1227500
LQTFSSFQKPLEPPNNNAPPRPR,ph,S,1794,true,"Phospho cell culture sucrose/TOR",109,30833711,,,0.9763930,,,,,
LQTFSSFQKPLEPPNNNAPPRPR,ph,S,1794,true,"Tissue atlas Arabidopsis - ProteomicsDB",114,32188942,"MaxQuant score",305.1700000,0.9994310,,,,0,
LQTFSSFQK,ph,S,1794,false,"atm and atr DNA damage response",88,25561503,"MASCOT Score",30.0000000,0.9590000,,,,,-0.8900000
LDSMESFSR,ph,S,1972,true,"Tissue atlas Arabidopsis - ProteomicsDB",114,32188942,"MaxQuant score",158.0500000,0.9764050,,,,0.000416380004026,
NYSGTDHHGAAADYDDQTETK,ph,S,1985,true,"srk2dei ABA signaling phopshoproteomics",83,23572148,"MASCOT Score",22.0000000,,,,,,-0.0016000
NYSGTDHHGAAADYDDQTETK,ph,S,1985,true,"TOR Kinase and ABA Receptor",100,29290610,XCorr,4.2997656,0.9101000,,,,1.5109999917939E-9,
NYSGTDHHGAAADYDDQTETK,ph,S,1985,true,"Lateral root-induction - NAA vs control",106,23328941,"MASCOT Score",25.0000000,,0.1286469,0.6555514,NO,,
NYSGTDHHGAAADYDDQTETK,ph,S,1985,true,"Phospho cell culture sucrose/TOR",109,30833711,,,0.9780410,,,,,
NYSGTDHHGAAADYDDQTETK,ph,S,1985,true,"Tissue atlas Arabidopsis - ProteomicsDB",114,32188942,"MaxQuant score",231.7200000,0.9997350,,,,0,
NYSGTDHHGAAADYDDQTETKSDNGSK,ph,T,2002,true,"Tissue atlas Arabidopsis - ProteomicsDB",114,32188942,"MaxQuant score",163.8200000,0.7592240,,,,0,
NYSGTDHHGAAADYDDQTETKSDNGSK,ph,S,2004,true,"Tissue atlas Arabidopsis - ProteomicsDB",114,32188942,"MaxQuant score",254.0000000,0.8593940,,,,0,
DEGRISGSHEHASR,ph,S,2057,true,"atm and atr DNA damage response",88,25561503,"MASCOT Score",40.0000000,0.9990000,,,,,0.6600000
DEGRISGSHEHASR,ph,S,2057,true,"Phospho cell culture sucrose/TOR",109,30833711,,,0.8018280,,,,,
DEGRISGSHEHASR,ph,S,2057,true,"Col-0 callus - FC Col-0 vs. Col-0 Xray",111a,31410901,,28.8900000,,2.8707212,0.0000000,NO,,0.0430558
DEGRISGSHEHASR,ph,S,2057,true,"Col-0 X-ray callus - FC Col-0 vs. Col-0 Xray",111b,31410901,,28.8900000,,2.8707212,0.0000000,NO,,0.0430558
DEGRISGSHEHASR,ph,S,2057,true,"atm callus - FC atm vs. atm Xray",111c,31410901,,28.8900000,,-2.0014827,0.0000000,NO,,0.0430558
DEGRISGSHEHASR,ph,S,2057,true,"atm-3 X-ray callus - FC atm vs. atm Xray",111d,31410901,,28.8900000,,-2.0014827,0.0000000,NO,,0.0430558
DEGRISGSHEHASR,ph,S,2057,true,"Tissue atlas Arabidopsis - ProteomicsDB",114,32188942,"MaxQuant score",145.4800000,0.9997370,,,,1.4852800234166E-7,
ISGSHEHASR,ph,S,2057,true,"atm and atr DNA damage response",88,25561503,"MASCOT Score",39.0000000,1.0000000,,,,,0.2400000
DEGRISGSHEHASR,ph,S,2059,true,"Tissue atlas Arabidopsis - ProteomicsDB",114,32188942,"MaxQuant score",80.6380000,0.9978350,,,,0.00012099000014132,
TSAGNSDPRTSNDLEMVR,ph,S,2067,true,"atm and atr DNA damage response",88,25561503,"MASCOT Score",38.0000000,0.9850000,,,,,-0.5300000
TSAGNSDPRTSNDLEMVR,ph,S,2067,true,"Tissue atlas Arabidopsis - ProteomicsDB",114,32188942,"MaxQuant score",101.6400000,0.7787210,,,,1.7146800018963E-5,
TSAGNSDPRTSNDLEMVR,ph,S,2071,true,"atm and atr DNA damage response",88,25561503,"MASCOT Score",38.0000000,0.9850000,,,,,-0.5300000
TSAGNSDPRTSNDLEMVR,ph,S,2071,true,"Tissue atlas Arabidopsis - ProteomicsDB",114,32188942,"MaxQuant score",120.5400000,0.9999780,,,,8.4179997770616E-14,
TSAGNSDPRTSNDLEMVR,ph,T,2075,true,"atm and atr DNA damage response",88,25561503,"MASCOT Score",38.0000000,1.0000000,,,,,-0.5300000
TSAGNSDPRTSNDLEMVR,ph,T,2075,true,"TOR Kinase and ABA Receptor",100,29290610,XCorr,3.1398149,0.8663000,,,,0.00094810000155121,
TSAGNSDPRTSNDLEMVR,ph,S,2076,true,"atm and atr DNA damage response",88,25561503,"MASCOT Score",36.0000000,0.9840000,,,,,-0.0600000
TSNDLEMVR,ph,S,2076,true,"atm and atr DNA damage response",88,25561503,"MASCOT Score",49.0000000,0.9980000,,,,,0.3000000
TSNDLEMVR,ph,S,2076,true,"TOR Kinase and ABA Receptor",100,29290610,XCorr,2.0437405,0.8969000,,,,0.0058840001001954,
TSNDLEMVR,ph,S,2076,true,"Tissue atlas Arabidopsis - ProteomicsDB",114,32188942,"MaxQuant score",175.2300000,0.9838100,,,,3.2039098886758E-28,
ATTTSTSGSLMR,ph,S,2595,true,"Tissue atlas Arabidopsis - ProteomicsDB",114,32188942,"MaxQuant score",106.5400000,0.8136090,,,,2.4457900508423E-5,
