Peptide,PTM,ModifiedAA,ModifiedPosition,PeptideUniqueToGene,ExperimentDesc,ExpID,PubmedID,ScoreType,IdentScore,LocProb,Log2FChange,PQ-val,QuantSig,PEP,MassErrorPPM
HNITQILADSPDYSSFNSYLSQTK,ng,N,27,true,"N-glycan occupancy Arabidopsis glycoproteins",87,23994444,"Ladder score",63.1000000,,,,,,
GTTLSTTLYQTTGNAPGNLGFVNITDLKGGK,ng,N,128,true,"Conserved N-glycosylation",74,22633491,"MaxQuant Score",219.3700000,0.9970000,,,,0,-0.3530000
GTTLSTTLYQTTGNAPGNLGFVNITDLK,ng,N,128,true,"N-glycan occupancy Arabidopsis glycoproteins",87,23994444,"Ladder score",60.6000000,,,,,,
GTTLSTTLYQTTGNAPGNLGFVNITDLK,ng,N,128,true,"N-linked Glycan Micro-heterogeneity Arabidopsis",134,29237727,,,,,,,,
GTTLSTTLYQTTGNAPGNLGFVNITDLK,ng,N,128,true,"UDP-GlcNAc transporter glycopeptide analysis",135,30224661,,,,,,,1.6158588342688E-14,1.7000000
LDSSYTKSVK,ac,K,154,false,"Quantitative Acetylproteomics",101,29440448,,,,,,,,
NNISTLATNGAGKFDLTTSTSGDEVILHTGVAPSR,ng,N,273,true,"UDP-GlcNAc transporter glycopeptide analysis",135,30224661,,,,,,,2.5969764455658E-24,-2.6000000
TNKNNISTLATNGAGK,ng,N,273,true,"Conserved N-glycosylation",74,22633491,"MaxQuant Score",292.6200000,0.9960000,,,,0,0.0980000
TNKNNISTLATNGAGK,ng,N,273,true,"N-linked Glycan Micro-heterogeneity Arabidopsis",134,29237727,,,,,,,,
TNKNNISTLATNGAGK,ng,N,273,true,"UDP-GlcNAc transporter glycopeptide analysis",135,30224661,,,,,,,2.5993826494679E-17,0.6000000
NNISTLATNGAGK,ng,N,273,true,"UDP-GlcNAc transporter glycopeptide analysis",135,30224661,,,,,,,2.4897437423906E-14,0.0000000
