Peptide,PTM,ModifiedAA,ModifiedPosition,PeptideUniqueToGene,ExperimentDesc,ExpID,PubmedID,ScoreType,IdentScore,LocProb,Log2FChange,PQ-val,QuantSig,PEP,MassErrorPPM
MDASNPNSSRKSNVSSF,nta,M,33,true,"Arabidopsis translation initiation landscape - NTA",167a,35069635,,,,,,,,
MDASNPNSSR,nta,M,33,true,"Arg/N-end rule pathway Roots",80,25728785,"MASCOT Score",54.6200000,,,,,0.00021670000569429,
KSNVSSFAQSSR,ph,S,44,true,"atm and atr DNA damage response",88,25561503,"MASCOT Score",47.0000000,1.0000000,,,,,-1.0400000
KSNVSSFAQSSR,ph,S,44,true,"Tissue atlas Arabidopsis - ProteomicsDB",114,32188942,"MaxQuant score",69.4310000,0.9998450,,,,0.0036007598973811,
KSNVSSFAQSSR,ph,S,48,true,"Tissue atlas Arabidopsis - ProteomicsDB",114,32188942,"MaxQuant score",81.1850000,0.8638040,,,,0.00088738597696647,
KSNVSSFAQSSR,ph,S,52,true,"Tissue atlas Arabidopsis - ProteomicsDB",114,32188942,"MaxQuant score",57.7030000,0.7796470,,,,0.012861100025475,
ANQGHSITTVESEK,ph,S,168,false,"Tissue atlas Arabidopsis - ProteomicsDB",114,32188942,"MaxQuant score",135.2900000,0.9957070,,,,2.2218400772545E-5,
ANQGHSITTVESEK,ph,S,174,false,"Tissue atlas Arabidopsis - ProteomicsDB",114,32188942,"MaxQuant score",187.5000000,1.0000000,,,,2.7636599543827E-23,
PILSPEEAPVCVHGTYR,so,C,190,false,"Arabidopsis S-sulfenylation chemoproteomics",108,31578252,"pFind PSM Score",0.0274771,,,,,,-1.4601511
