Peptide,PTM,ModifiedAA,ModifiedPosition,PeptideUniqueToGene,ExperimentDesc,ExpID,PubmedID,ScoreType,IdentScore,LocProb,Log2FChange,PQ-val,QuantSig,PEP,MassErrorPPM
HFSSISPSEAAAAVK,ph,S,18,true,"Tissue atlas Arabidopsis - ProteomicsDB",114,32188942,"MaxQuant score",207.7900000,0.9983680,,,,2.8025969286496E-45,
FVNKEDGSSPAVK,ph,S,122,true,"Large-scale phosphorylation discovery",44,23111157,XCorr,3.7620000,,,,,,
FVNKEDGSSPAVK,ph,S,122,true,"atm and atr DNA damage response",88,25561503,"MASCOT Score",29.0000000,1.0000000,,,,,-1.6900000
FVNKEDGSSPAVK,ph,S,122,true,"Phospho cell culture sucrose/TOR",109,30833711,,,0.8311420,,,,,
FVNKEDGSSPAVK,ph,S,122,true,"Tissue atlas Arabidopsis - ProteomicsDB",114,32188942,"MaxQuant score",232.7800000,0.8312610,,,,0,
FVNKEDGSSPAVK,ph,S,123,true,"Large-scale phosphorylation discovery",44,23111157,XCorr,3.4620000,,,,,,
FVNKEDGSSPAVK,ph,S,123,true,"SnRK2 protein kinase substrates",85,23776212,XCorr,2.8295734,0.9940000,,,,0.012509499676526,
FVNKEDGSSPAVK,ph,S,123,true,"Phospho cell culture sucrose/TOR",109,30833711,,,0.9718730,,,,,
FVNKEDGSSPAVK,ph,S,123,true,"Col-0 callus - FC Col-0 vs. Col-0 Xray",111a,31410901,,57.2800000,,0.6974176,0.0000000,NO,,0.6260617
FVNKEDGSSPAVK,ph,S,123,true,"Col-0 X-ray callus - FC Col-0 vs. Col-0 Xray",111b,31410901,,57.2800000,,0.6974176,0.0000000,NO,,0.6260617
FVNKEDGSSPAVK,ph,S,123,true,"atm callus - FC atm vs. atm Xray",111c,31410901,,57.2800000,,2.9431882,0.0000000,NO,,0.6260617
FVNKEDGSSPAVK,ph,S,123,true,"atm-3 X-ray callus - FC atm vs. atm Xray",111d,31410901,,57.2800000,,2.9431882,0.0000000,NO,,0.6260617
FVNKEDGSSPAVK,ph,S,123,true,"Tissue atlas Arabidopsis - ProteomicsDB",114,32188942,"MaxQuant score",270.7500000,0.9932410,,,,0,
EDGSSPAVK,ph,S,123,true,"atm and atr DNA damage response",88,25561503,"MASCOT Score",30.0000000,0.9550000,,,,,-0.3300000
SVSLENLQKK,me2,K,739,true,"Arabidopsis protein methylome",123,31809900,"MaxQuant Score",219.5000000,1.0000000,,,,0,0.3777900
