Peptide,PTM,ModifiedAA,ModifiedPosition,PeptideUniqueToGene,ExperimentDesc,ExpID,PubmedID,ScoreType,IdentScore,LocProb,Log2FChange,PQ-val,QuantSig,PEP,MassErrorPPM
RLPSKGPVSGHLSR,ph,S,15,true,"atm and atr DNA damage response",88,25561503,"MASCOT Score",33.0000000,1.0000000,,,,,-0.0700000
RLPSKGPVSGHLSR,ph,S,15,true,"Phospho cell culture sucrose/TOR",109,30833711,,,0.9999990,,,,,
RLPSKGPVSGHLSR,ph,S,15,true,"Tissue atlas Arabidopsis - ProteomicsDB",114,32188942,"MaxQuant score",66.8930000,0.9995840,,,,0.0010700500570238,
LPSKGPVSGHLSR,ph,S,15,true,"atm and atr DNA damage response",88,25561503,"MASCOT Score",23.0000000,1.0000000,,,,,-0.5500000
ELSQVLNVHR,ph,S,68,true,"Tissue atlas Arabidopsis - ProteomicsDB",114,32188942,"MaxQuant score",143.0000000,1.0000000,,,,6.0269502455412E-7,
GSNDMSEEAGSSSFR,ph,S,136,true,"Conserved plant phosphoproteome - Arabidopsis",61a,20466843,"MASCOT Score",22.0000000,1.0000000,,,,,
GSNDMSEEAGSSSFR,ph,S,137,true,"Phospho cell culture sucrose/TOR",109,30833711,,,0.7716970,,,,,
GSNDMSEEAGSSSFR,ph,S,137,true,"Tissue atlas Arabidopsis - ProteomicsDB",114,32188942,"MaxQuant score",241.8000000,0.8657180,,,,0,
GSNDMSEEAGSSSFR,ph,S,138,true,"Phosphorylation Early Elicitor Signaling",23,17317660,,,,,,,,
GSNDMSEEAGSSSFR,ph,S,138,true,"Phospho cell culture sucrose/TOR",109,30833711,,,0.9323590,,,,,
GSNDMSEEAGSSSFR,ph,S,138,true,"Tissue atlas Arabidopsis - ProteomicsDB",114,32188942,"MaxQuant score",286.7300000,0.9544700,,,,0,
AMSIANSSSATSTTQR,fuc,S,269,true,"SPINDLY O-fucosylation",162,36739885,,,,,,,-0.81999999284744,
AMSIANSSSATSTTQR,ph,S,269,true,"Phospho cell culture sucrose/TOR",109,30833711,,,1.0000000,,,,,
AMSIANSSSATSTTQR,ph,S,269,true,"Tissue atlas Arabidopsis - ProteomicsDB",114,32188942,"MaxQuant score",224.6400000,1.0000000,,,,0,
AMSIANSSSATSTTQR,fuc,S,273,true,"SPINDLY O-fucosylation",162,36739885,,,,,,,-0.62999999523163,
SISMVLDSFESTK,ph,S,299,true,"TOR Kinase and ABA Receptor",100,29290610,XCorr,3.2550819,0.9296000,,,,0.00015360000543296,
ASDSSGLSEESSWSNFTGSLNKPHK,ph,S,316,true,"Tissue atlas Arabidopsis - ProteomicsDB",114,32188942,"MaxQuant score",109.4400000,0.9702320,,,,9.3650002278724E-22,
SMSFVGTHEYLAPEIIK,ph,S,594,false,"Phosphorylation Early Elicitor Signaling",23,17317660,,,,,,,,
SMSFVGTHEYLAPEIIK,ph,S,594,false,"Lateral root-induction - NAA vs control",106,23328941,"MASCOT Score",41.0000000,,,,,,
SMSFVGTHEYLAPEIIK,ph,S,594,false,"Phosphorylation tonoplast membrane fraction",107,18686298,"MASCOT Score",51.0000000,,,,,,
SMSFVGTHEYLAPEIIK,ph,S,594,false,"Tissue atlas Arabidopsis - ProteomicsDB",114,32188942,"MaxQuant score",209.2500000,0.9631280,,,,0,
SMSFVGTHEYLAPEIIK,ph,S,596,false,"Arabidopsis root NAA phosphoproteome",18a,27643528,"MaxQuant Score",98.5430000,0.9580000,,,,1.1639999727975E-11,0.3950000
SMSFVGTHEYLAPEIIK,ph,S,596,false,"MAPK Arabidopsis substrates",45,23172892,"MaxQuant Score",166.0400000,,,,,,
SMSFVGTHEYLAPEIIK,ph,S,596,false,"Phosphoproteome ethylene-regulated time response",46,24043427,"MASCOT Score",104.1200000,,,,,,-4.6344000
SMSFVGTHEYLAPEIIK,ph,S,596,false,"PAMP-triggered phosphorylation",48,24601666,"MASCOT Score",23.8400000,,,,,,
SMSFVGTHEYLAPEIIK,ph,S,596,false,"srk2dei ABA signaling phopshoproteomics",83,23572148,"MASCOT Score",67.0000000,,,,,,-0.0011000
SMSFVGTHEYLAPEIIK,ph,S,596,false,"SnRK2 protein kinase substrates",85,23776212,XCorr,3.4767542,0.9090000,,,,0.00037180300569162,
SMSFVGTHEYLAPEIIK,ph,S,596,false,"atm and atr DNA damage response",88,25561503,"MASCOT Score",46.0000000,0.9970000,,,,,-0.8700000
SMSFVGTHEYLAPEIIK,ph,S,596,false,"TOR Kinase and ABA Receptor",100,29290610,XCorr,3.9828887,0.9920000,,,,6.5260001065326E-6,
SMSFVGTHEYLAPEIIK,ph,S,596,false,"Lateral root-induction - NAA vs control",106,23328941,"MASCOT Score",31.0000000,,,,,,
SMSFVGTHEYLAPEIIK,ph,S,596,false,"Phosphorylation tonoplast membrane fraction",107,18686298,"MASCOT Score",51.0000000,,,,,,
SMSFVGTHEYLAPEIIK,ph,S,596,false,"Phospho cell culture sucrose/TOR",109,30833711,,,0.9982700,,,,,
SMSFVGTHEYLAPEIIK,ph,S,596,false,"Tissue atlas Arabidopsis - ProteomicsDB",114,32188942,"MaxQuant score",356.3100000,0.9999950,,,,0,
CSTPPEVPR,ox,C,707,true,"OxiTRAQ Arabidopsis - 5 mM H2O2 versus control",47,24376095,,,,0.3959540,0.0195643,NO,,
YGPIDPVGFGSNSKR,ph,S,735,true,"Tissue atlas Arabidopsis - ProteomicsDB",114,32188942,"MaxQuant score",177.1200000,0.7626450,,,,1.36098003662E-19,
YGPIDPVGFGSNSKR,ph,S,737,true,"atm and atr DNA damage response",88,25561503,"MASCOT Score",30.0000000,1.0000000,,,,,-1.1200000
YGPIDPVGFGSNSKR,ph,S,737,true,"Tissue atlas Arabidopsis - ProteomicsDB",114,32188942,"MaxQuant score",181.7200000,0.9482670,,,,3.2608499824445E-25,
YGPIDPVGFGSNSK,ph,S,737,true,"TOR Kinase and ABA Receptor",100,29290610,XCorr,3.0149226,0.9192000,,,,3.723999907379E-5,
