Peptide,PTM,ModifiedAA,ModifiedPosition,PeptideUniqueToGene,ExperimentDesc,ExpID,PubmedID,ScoreType,IdentScore,LocProb,Log2FChange,PQ-val,QuantSig,PEP,MassErrorPPM
QGNESGDDDDHDDGNYTAR,ph,S,167,true,"STN8 phosphoproteome",38,21768351,"MASCOT Score",45.4600000,,,,,,-0.7554790
QGNESGDDDDHDDGNYTAR,ph,S,167,true,"Chloroplast kinase substrates",60,19376835,"MASCOT Score",56.0400000,,,,,,-0.7554790
QGNESGDDDDHDDGNYTAR,ph,S,167,true,"SnRK2 protein kinase substrates",85,23776212,XCorr,3.2257040,0.9990000,,,,0.015599600039423,
QGNESGDDDDHDDGNYTAR,ph,S,167,true,"atm and atr DNA damage response",88,25561503,"MASCOT Score",58.0000000,1.0000000,,,,,0.4500000
QGNESGDDDDHDDGNYTAR,ph,S,167,true,"TOR Kinase and ABA Receptor",100,29290610,XCorr,2.9987450,1.0000000,,,,0.0007830000249669,
YQFSGGGGGAR,ph,S,185,true,"atm and atr DNA damage response",88,25561503,"MASCOT Score",45.0000000,1.0000000,,,,,-0.3300000
YQFSGGGGGAR,ph,S,185,true,"Tissue atlas Arabidopsis - ProteomicsDB",114,32188942,"MaxQuant score",92.1120000,1.0000000,,,,0.0002968650078401,
IDQKYTASPSAGVSSNPR,sumo,K,242,true,"SUMO Ligase SIZ1 heat stress",4,29588388,,,,,,,,
YTASPSAGVSSNPR,ph,T,244,true,"Lateral root-induction - NAA vs control",106,23328941,"MASCOT Score",37.0000000,,,,,,
YTASPSAGVSSNPR,ph,S,246,true,"atm and atr DNA damage response",88,25561503,"MASCOT Score",80.0000000,0.8900000,,,,,-0.3900000
YTASPSAGVSSNPR,ph,S,246,true,"TOR Kinase and ABA Receptor",100,29290610,XCorr,4.3669424,0.9948000,,,,5.0889998419734E-6,
YTASPSAGVSSNPR,ph,S,246,true,"Lateral root-induction - NAA vs control",106,23328941,"MASCOT Score",49.0000000,,,,,,
YTASPSAGVSSNPR,ph,S,246,true,"Tissue atlas Arabidopsis - ProteomicsDB",114,32188942,"MaxQuant score",263.5600000,1.0000000,,,,0,
YTASPSAGVSSNPR,ph,S,248,true,"Tissue atlas Arabidopsis - ProteomicsDB",114,32188942,"MaxQuant score",106.4200000,0.9958950,,,,9.396569657838E-5,
YTASPSAGVSSNPR,ph,S,253,true,"Tissue atlas Arabidopsis - ProteomicsDB",114,32188942,"MaxQuant score",133.9100000,0.8996430,,,,2.6416000764584E-5,
SLSDYTTTEEQDKK,ph,S,357,true,"atm and atr DNA damage response",88,25561503,"MASCOT Score",30.0000000,0.9930000,,,,,-2.4200000
SLSDYTTTEEQDKK,ph,S,357,true,"Tissue atlas Arabidopsis - ProteomicsDB",114,32188942,"MaxQuant score",217.1900000,0.9999980,,,,0,
