Peptide,PTM,ModifiedAA,ModifiedPosition,PeptideUniqueToGene,ExperimentDesc,ExpID,PubmedID,ScoreType,IdentScore,LocProb,Log2FChange,PQ-val,QuantSig,PEP,MassErrorPPM
QEAEQKK,me2,K,34,true,"Arabidopsis protein methylome",123,31809900,"MaxQuant Score",76.2210000,1.0000000,,,,0.012359499931335,0.0638060
KSGKHQKQSSSR,ub,K,193,true,"Arabidopsis ubiquitination COFRADIC",40,26744219,"MaxQuant Score",119.8700000,0.9980000,,,,2.4049999838849E-11,0.5850000
HYERPRSDLEDESK,ph,S,234,true,"TOR Kinase and ABA Receptor",100,29290610,XCorr,3.0436087,0.9996000,,,,0.00014699999883305,
HYERPRSDLEDESK,ph,S,234,true,"Phospho cell culture sucrose/TOR",109,30833711,,,0.9999990,,,,,
HYERPRSDLEDESK,ph,S,234,true,"Tissue atlas Arabidopsis - ProteomicsDB",114,32188942,"MaxQuant score",202.9400000,1.0000000,,,,1.9057659114818E-42,
PRSDLEDESK,ph,S,234,true,"atm and atr DNA damage response",88,25561503,"MASCOT Score",46.0000000,1.0000000,,,,,-0.1900000
QRSDLDDEYKR,ph,S,318,true,"atm and atr DNA damage response",88,25561503,"MASCOT Score",32.0000000,1.0000000,,,,,-1.3300000
QRSDLDDEYKR,ph,S,318,true,"Phospho cell culture sucrose/TOR",109,30833711,,,1.0000000,,,,,
QRSDLDDEYK,ph,S,318,true,"atm and atr DNA damage response",88,25561503,"MASCOT Score",44.0000000,1.0000000,,,,,-0.7600000
QRSDLDDEYK,ph,S,318,true,"TOR Kinase and ABA Receptor",100,29290610,XCorr,3.3552876,1.0000000,,,,0.00052429997595027,
SDLDDEYKR,ph,S,318,true,"Tissue atlas Arabidopsis - ProteomicsDB",114,32188942,"MaxQuant score",329.7000000,1.0000000,,,,0,
SDLDDEYKR,ub,K,325,true,"Arabidopsis ubiquitination COFRADIC",40,26744219,"MaxQuant Score",150.2700000,1.0000000,,,,1.6990000308329E-14,0.3240000
RRSDIDDEPK,ph,S,336,true,"Tissue atlas Arabidopsis - ProteomicsDB",114,32188942,"MaxQuant score",95.8540000,1.0000000,,,,0.0001842600031523,
DARPNEKYR,ub,K,352,true,"Arabidopsis ubiquitination COFRADIC",40,26744219,"MaxQuant Score",78.9390000,1.0000000,,,,0.0060000000521541,0.4170000
SPKGGVER,ub,K,359,true,"Arabidopsis ubiquitination COFRADIC",40,26744219,"MaxQuant Score",80.6880000,1.0000000,,,,0.026000000536442,-0.3920000
ENLKSYGQEDKKR,ub,K,368,true,"Arabidopsis ubiquitination COFRADIC",40,26744219,"MaxQuant Score",61.4090000,1.0000000,,,,0.00073510000947863,1.0320000
ENLKSYGQEDKKR,ub,K,375,true,"Arabidopsis ubiquitination COFRADIC",40,26744219,"MaxQuant Score",48.5270000,0.8310000,,,,0.0010000000474975,0.3400000
KGGSKLSEEER,ub,K,400,true,"Arabidopsis ubiquitination COFRADIC",40,26744219,"MaxQuant Score",66.2670000,0.8330000,,,,0.00040019999141805,-0.4920000
GGSSTIEESVR,ph,S,472,true,"Tissue atlas Arabidopsis - ProteomicsDB",114,32188942,"MaxQuant score",93.7660000,0.9999990,,,,0.00019935499585699,
