Peptide,PTM,ModifiedAA,ModifiedPosition,PeptideUniqueToGene,ExperimentDesc,ExpID,PubmedID,ScoreType,IdentScore,LocProb,Log2FChange,PQ-val,QuantSig,PEP,MassErrorPPM
DENDDDEEEALSAMSSVPPPR,ph,S,21,true,"Tissue atlas Arabidopsis - ProteomicsDB",114,32188942,"MaxQuant score",84.2490000,0.9839070,,,,8.3705299402936E-7,
DENDDDEEEALSAMSSVPPPR,ph,S,25,true,"Tissue atlas Arabidopsis - ProteomicsDB",114,32188942,"MaxQuant score",134.5800000,0.9019940,,,,4.207780029481E-22,
IHSYSHQLR,ph,S,34,true,"Tissue atlas Arabidopsis - ProteomicsDB",114,32188942,"MaxQuant score",101.1200000,0.9999060,,,,0.00028346499311738,
IHSYSHQLR,ph,S,36,true,"Tissue atlas Arabidopsis - ProteomicsDB",114,32188942,"MaxQuant score",68.7860000,0.9116560,,,,0.0029646600596607,
QRQHSLDDIPK,ph,S,54,true,"Tissue atlas Arabidopsis - ProteomicsDB",114,32188942,"MaxQuant score",171.6300000,1.0000000,,,,1.7901800219988E-6,
QHSLDDIPK,ph,S,54,true,"Pollen phosphoproteome Arabidopsis",43,22631563,"MASCOT Score",49.8800000,,,,,,
SRNAIMGAADAVR,ph,S,418,false,"Tissue atlas Arabidopsis - ProteomicsDB",114,32188942,"MaxQuant score",54.3150000,1.0000000,,,,0.008244370110333,
SSNAHNAPAAGVSTGSHTTK,ph,S,761,true,"Tissue atlas Arabidopsis - ProteomicsDB",114,32188942,"MaxQuant score",121.2600000,0.9388530,,,,2.4164999643495E-17,
SSNAHNAPAAGVSTGSHTTK,ph,T,766,true,"Tissue atlas Arabidopsis - ProteomicsDB",114,32188942,"MaxQuant score",154.4600000,0.9010620,,,,6.2653799245947E-29,
SANNANVNTEETK,ph,S,769,true,"Tissue atlas Arabidopsis - ProteomicsDB",114,32188942,"MaxQuant score",186.7500000,1.0000000,,,,2.8404599180182E-22,
HRPGLGGYDSGEK,ph,S,864,true,"Tissue atlas Arabidopsis - ProteomicsDB",114,32188942,"MaxQuant score",68.5250000,0.9997460,,,,0.00086855900008231,
TNEKVRALLNDLR,ub,K,946,true,"Arabidopsis ubiquitination by TUBEs",2,23667124,,,,,,,,
TNEKVRALLNDLR,ub,K,946,true,"MudPIT plant ubiquitination",103,17272265,XCorr,2.6000000,,,,,,
IDSNPSNSKSQSLK,ph,S,1106,true,"Tissue atlas Arabidopsis - ProteomicsDB",114,32188942,"MaxQuant score",96.4680000,0.8130470,,,,0.00011874699703185,
IDSNPSNSKSQSLK,ph,S,1108,true,"Tissue atlas Arabidopsis - ProteomicsDB",114,32188942,"MaxQuant score",77.1910000,0.7503800,,,,0.0011396500049159,
IDSNPSNSKSQSLKK,ph,S,1110,true,"Tissue atlas Arabidopsis - ProteomicsDB",114,32188942,"MaxQuant score",124.6300000,0.9222630,,,,9.3846898607808E-7,
KNSNSSTVEESR,ph,S,1301,true,"Tissue atlas Arabidopsis - ProteomicsDB",114,32188942,"MaxQuant score",83.2700000,0.9936160,,,,0.00055579701438546,
NSNSSTVEESRNNHNKR,ph,S,1309,true,"Tissue atlas Arabidopsis - ProteomicsDB",114,32188942,"MaxQuant score",92.2890000,0.9980140,,,,1.7593200027477E-5,
