Peptide,PTM,ModifiedAA,ModifiedPosition,PeptideUniqueToGene,ExperimentDesc,ExpID,PubmedID,ScoreType,IdentScore,LocProb,Log2FChange,PQ-val,QuantSig,PEP,MassErrorPPM
LASSSPALSSGPKEVE,nt,L,35,true,"N-terminal ChaFRADIC",92,26010716,"MASCOT Score",22.3000000,,,,,0.0070270001888275,
LASSSPALSSGPKEVE,nta,L,35,true,"N-terminal ChaFRADIC",92,26010716,"MASCOT Score",22.3000000,,,,,0.0070270001888275,
ASSSPALSSGPKEVE,nt,A,36,true,"N-terminal ChaFRADIC",92,26010716,"MASCOT Score",47.4900000,,,,,3.6330000057205E-6,
ASSSPALSSGPKEVE,nt,A,36,true,"HUNTER N-terminome: legumain, GluC and trypsin",119,31951383,"MaxQuant score",213.7300000,,,,,,
ASSSPALSSGPKE,nt,A,36,true,"N-terminal ChaFRADIC",92,26010716,"MASCOT Score",41.9300000,,,,,0.00072459998773411,
ASSSPALSSGPKEVE,nta,A,36,true,"N-terminal ChaFRADIC",92,26010716,"MASCOT Score",43.5100000,,,,,6.0959999245824E-5,
ASSSPALSSGPKEVE,nta,A,36,true,"HUNTER N-terminome: legumain, GluC and trypsin",119,31951383,"MaxQuant score",71.2410000,,,,,,
ASSSPALSSGPKE,nta,A,36,true,"N-terminal ChaFRADIC",92,26010716,"MASCOT Score",35.4800000,,,,,0.0032860001083463,
ASSSPALSSGPK,nta,A,36,true,"Characterization plant N-terminal acetylation",6,22223895,"MASCOT Score",83.9200000,,,,,,
SSSPALSSGPKEVESLKKPF,nt,S,37,true,"Arabidopsis translation initiation landscape - NT",167b,35069635,,,,,,,,
SSSPALSSGPKEVE,nt,S,37,true,"N-terminal ChaFRADIC",92,26010716,"MASCOT Score",38.2600000,,,,,0.00095560000045225,
SSSPALSSGPKEVE,nt,S,37,true,"HUNTER N-terminome: legumain, GluC and trypsin",119,31951383,"MaxQuant score",156.3600000,,,,,,
SSSPALSSGPKE,nt,S,37,true,"N-terminal ChaFRADIC",92,26010716,"MASCOT Score",33.8600000,,,,,0.054400000721216,
SSSPALSSGPKEVESLKKPFTPPR,nta,S,37,true,"HUNTER N-terminome: legumain, GluC and trypsin",119,31951383,"MaxQuant score",50.5310000,,,,,,
SSSPALSSGPKEVE,nta,S,37,true,"N-terminal ChaFRADIC",92,26010716,"MASCOT Score",38.2600000,,,,,0.00095560000045225,
SSSPALSSGPKEVE,nta,S,37,true,"HUNTER N-terminome: legumain, GluC and trypsin",119,31951383,"MaxQuant score",,,,,,,
SSSPALSSGPKE,nta,S,37,true,"N-terminal ChaFRADIC",92,26010716,"MASCOT Score",33.8600000,,,,,0.054400000721216,
QAKEHGDIKLAQICGTIAADEKR,nt,Q,247,true,"HUNTER N-terminome: legumain, GluC and trypsin",119,31951383,"MaxQuant score",73.3220000,,,,,,
LAQICGTIAADEK,sno,C,260,true,"hot5-4 / wildtype, FAT-switch S-nitrosoproteome",169,37277371,,,,0.5627764,0.0246907,NO,,
LAQICGTIAADEK,so,C,260,true,"Arabidopsis S-sulfenylation chemoproteomics",108,31578252,"pFind PSM Score",0.0003554,,1.2570700,,,,-0.2490271
LAQICGTIAADEK,so,C,260,true,"S-sulfenylation site detection using YAP1C",110,32714340,,,,,,,,
ICGTIAADEK,so,C,260,false,"S-sulfenylation site detection using YAP1C",110,32714340,,,,,,,,
GTIAADEKR,nt,G,261,false,"Arg/N-end rule seed, prt6 vs. Wt",99,29168982,"MASCOT Score",22.1400000,,2.7125870,0.0001233,YES,0.044080000370741,-0.6951020
HETAYTKIVEK,ac,K,276,false,"Quantitative Acetylproteomics",101,29440448,,,,,,,,
AQDYLCGLAPR,sno,C,366,true,"hot5-4 / wildtype, FAT-switch S-nitrosoproteome",169,37277371,,,,0.7045947,0.0173078,YES,,
AQDYLCGLAPR,so,C,366,true,"Arabidopsis S-sulfenylation chemoproteomics",108,31578252,"pFind PSM Score",0.0110200,,0.9298300,,,,-2.3118325
AQDYLCGLAPR,so,C,366,true,"S-sulfenylation site detection using YAP1C",110,32714340,,,,,,,,
