Peptide,PTM,ModifiedAA,ModifiedPosition,PeptideUniqueToGene,ExperimentDesc,ExpID,PubmedID,ScoreType,IdentScore,LocProb,Log2FChange,PQ-val,QuantSig,PEP,MassErrorPPM
LRHGETNSFLPIFREPSSIEK,ph,T,49,true,"TOR Kinase and ABA Receptor",100,29290610,XCorr,4.7727904,0.9609000,,,,1.0130000191566E-5,
HGETNSFLPIFREPSSIEK,ph,T,49,true,"MAPK Arabidopsis substrates",45,23172892,"MaxQuant Score",131.2500000,,,,,,
HGETNSFLPIFREPSSIEK,ph,T,49,true,"TOR Kinase and ABA Receptor",100,29290610,XCorr,4.0105948,0.9741000,,,,0.00127899996005,
HGETNSFLPIFR,ph,T,49,true,"atm and atr DNA damage response",88,25561503,"MASCOT Score",37.0000000,1.0000000,,,,,-0.2400000
HGETNSFLPIFR,ph,T,49,true,"TOR Kinase and ABA Receptor",100,29290610,XCorr,3.9686053,0.9989000,,,,1.0970000403177E-5,
HGETNSFLPIFR,ph,T,49,true,"Tissue atlas Arabidopsis - ProteomicsDB",114,32188942,"MaxQuant score",298.1700000,1.0000000,,,,0,
LRHGETNSFLPIFR,ph,S,51,true,"TOR Kinase and ABA Receptor",100,29290610,XCorr,4.3746977,1.0000000,,,,0.00037190000875853,
HGETNSFLPIFR,ph,S,51,true,"atm and atr DNA damage response",88,25561503,"MASCOT Score",41.0000000,0.9280000,,,,,-2.4000000
HGETNSFLPIFR,ph,S,51,true,"Tissue atlas Arabidopsis - ProteomicsDB",114,32188942,"MaxQuant score",196.6700000,0.9999370,,,,1.3569799909299E-24,
DHNLVFRPPTPDRPNPYSASPPPRPASPR,ph,T,81,true,"TOR Kinase and ABA Receptor",100,29290610,XCorr,3.9966958,0.9664000,,,,0.0041919997893274,
DHNLVFRPPTPDRPNPYSASPPPRPASPR,ph,S,91,true,"LAXIC - mannitol vs control",84b,23660473,XCorr,3.0900000,0.7560000,,,,0.00034831499215215,
DHNLVFRPPTPDRPNPYSASPPPRPASPR,ph,S,91,true,"TOR Kinase and ABA Receptor",100,29290610,XCorr,3.9966958,0.8959000,,,,0.0041919997893274,
DHNLVFRPPTPDRPNPYSASPPPRPASPR,ph,S,98,true,"TOR Kinase and ABA Receptor",100,29290610,XCorr,3.9966958,0.9812000,,,,0.0041919997893274,
VASPRPTSPR,ph,S,103,true,"Chloroplast kinase substrates",60,19376835,"MASCOT Score",30.2000000,,,,,,0.4205150
VASPRPTSPR,ph,S,103,true,"SnRK2 protein kinase substrates",85,23776212,XCorr,2.0668988,0.8930000,,,,0.010654900223017,
VASPRPTSPR,ph,S,103,true,"Phospho cell culture sucrose/TOR",109,30833711,,,0.9999510,,,,,
VASPRPTSPR,ph,S,103,true,"Tissue atlas Arabidopsis - ProteomicsDB",114,32188942,"MaxQuant score",102.7300000,0.9999980,,,,0.00010997200297425,
VASPRPTSPR,ph,T,107,true,"Chloroplast kinase substrates",60,19376835,"MASCOT Score",30.2000000,,,,,,0.4205150
VASPRPTSPR,ph,T,107,true,"atm and atr DNA damage response",88,25561503,"MASCOT Score",25.0000000,0.8180000,,,,,0.7000000
VASPRPTSPR,ph,T,107,true,"Tissue atlas Arabidopsis - ProteomicsDB",114,32188942,"MaxQuant score",83.0870000,0.9261700,,,,0.0015421600546688,
VASPRPTSPR,ph,S,108,true,"Chloroplast kinase substrates",60,19376835,"MASCOT Score",43.7200000,,,,,,-0.3607810
VASPRPTSPR,ph,S,108,true,"Col-0 callus - FC Col-0 vs. Col-0 Xray",111a,31410901,,33.2800000,,0.4049210,0.0000000,NO,,0.6693894
VASPRPTSPR,ph,S,108,true,"Col-0 X-ray callus - FC Col-0 vs. Col-0 Xray",111b,31410901,,33.2800000,,0.4049210,0.0000000,NO,,0.6693894
VASPRPTSPR,ph,S,108,true,"atm callus - FC atm vs. atm Xray",111c,31410901,,33.2800000,,1.8000040,0.0000000,NO,,0.6693894
VASPRPTSPR,ph,S,108,true,"atm-3 X-ray callus - FC atm vs. atm Xray",111d,31410901,,33.2800000,,1.8000040,0.0000000,NO,,0.6693894
VASPRPTSPR,ph,S,108,true,"Tissue atlas Arabidopsis - ProteomicsDB",114,32188942,"MaxQuant score",124.2100000,0.9989370,,,,2.6237899874104E-5,
VASPRVPSPR,ph,S,113,true,"Chloroplast kinase substrates",60,19376835,"MASCOT Score",33.1600000,,,,,,1.4483100
TLSPKPPSPR,ph,T,126,true,"Conserved plant phosphoproteome - Arabidopsis",61a,20466843,"MASCOT Score",24.0000000,1.0000000,,,,,
TLSPKPPSPR,ph,S,128,true,"Phytohormone-responsive phosphoproteins",34,20374526,"MASCOT Score",40.0000000,,,,,,11.7463000
TLSPKPPSPR,ph,S,128,true,"Phosphoproteome ethylene-regulated time response",46,24043427,"MASCOT Score",41.2300000,,,,,,-1.9872000
TLSPKPPSPR,ph,S,128,true,"Conserved plant phosphoproteome - Arabidopsis",61a,20466843,"MASCOT Score",25.0000000,1.0000000,,,,,
TLSPKPPSPR,ph,S,128,true,"srk2dei ABA signaling phopshoproteomics",83,23572148,"MASCOT Score",33.0000000,,,,,,0.0004000
TLSPKPPSPR,ph,S,128,true,"LAXIC - mannitol vs control",84b,23660473,XCorr,2.1800000,0.9440000,-1.1552947,,NO,0.039494998753071,
TLSPKPPSPR,ph,S,128,true,"SnRK2 protein kinase substrates",85,23776212,XCorr,2.1480935,0.9550000,,,,0.0010115499608219,
TLSPKPPSPR,ph,S,128,true,"atm and atr DNA damage response",88,25561503,"MASCOT Score",36.0000000,0.9920000,,,,,-1.7500000
TLSPKPPSPR,ph,S,128,true,"TOR Kinase and ABA Receptor",100,29290610,XCorr,2.8909206,0.9839000,,,,0.0010959999635816,
TLSPKPPSPR,ph,S,128,true,"Lateral root-induction - NAA vs control",106,23328941,"MASCOT Score",27.0000000,,,,,,
TLSPKPPSPR,ph,S,128,true,"Phospho cell culture sucrose/TOR",109,30833711,,,0.9999320,,,,,
TLSPKPPSPR,ph,S,128,true,"Col-0 callus - FC Col-0 vs. Col-0 Xray",111a,31410901,,38.7500000,,-0.0016386,0.0000000,NO,,-0.5161950
TLSPKPPSPR,ph,S,128,true,"Col-0 X-ray callus - FC Col-0 vs. Col-0 Xray",111b,31410901,,38.7500000,,-0.0016386,0.0000000,NO,,-0.5161950
TLSPKPPSPR,ph,S,128,true,"atm callus - FC atm vs. atm Xray",111c,31410901,,38.7500000,,-0.0699971,0.0000000,NO,,-0.5161950
TLSPKPPSPR,ph,S,128,true,"atm-3 X-ray callus - FC atm vs. atm Xray",111d,31410901,,38.7500000,,-0.0699971,0.0000000,NO,,-0.5161950
TLSPKPPSPR,ph,S,128,true,"Tissue atlas Arabidopsis - ProteomicsDB",114,32188942,"MaxQuant score",132.5000000,0.9999950,,,,1.3509100426745E-5,
TLSPKPPSPR,ph,S,133,true,"Phytohormone-responsive phosphoproteins",34,20374526,"MASCOT Score",40.0000000,,,,,,11.7463000
TLSPKPPSPR,ph,S,133,true,"Phosphoproteome ethylene-regulated time response",46,24043427,"MASCOT Score",41.2300000,,,,,,-1.9872000
TLSPKPPSPR,ph,S,133,true,"Conserved plant phosphoproteome - Arabidopsis",61a,20466843,"MASCOT Score",24.0000000,1.0000000,,,,,
TLSPKPPSPR,ph,S,133,true,"srk2dei ABA signaling phopshoproteomics",83,23572148,"MASCOT Score",33.0000000,,,,,,0.0004000
TLSPKPPSPR,ph,S,133,true,"LAXIC - mannitol vs control",84b,23660473,XCorr,2.1800000,0.9950000,-1.1552947,,NO,0.039494998753071,
TLSPKPPSPR,ph,S,133,true,"SnRK2 protein kinase substrates",85,23776212,XCorr,2.1480935,1.0000000,,,,0.0010115499608219,
TLSPKPPSPR,ph,S,133,true,"atm and atr DNA damage response",88,25561503,"MASCOT Score",36.0000000,1.0000000,,,,,-1.7500000
TLSPKPPSPR,ph,S,133,true,"TOR Kinase and ABA Receptor",100,29290610,XCorr,2.8909206,1.0000000,,,,0.0010959999635816,
TLSPKPPSPR,ph,S,133,true,"Lateral root-induction - NAA vs control",106,23328941,"MASCOT Score",27.0000000,,,,,,
TLSPKPPSPR,ph,S,133,true,"Phospho cell culture sucrose/TOR",109,30833711,,,1.0000000,,,,,
TLSPKPPSPR,ph,S,133,true,"Col-0 callus - FC Col-0 vs. Col-0 Xray",111a,31410901,,29.1700000,,-0.2587113,0.0000000,NO,,0.1086521
TLSPKPPSPR,ph,S,133,true,"Col-0 X-ray callus - FC Col-0 vs. Col-0 Xray",111b,31410901,,29.1700000,,-0.2587113,0.0000000,NO,,0.1086521
TLSPKPPSPR,ph,S,133,true,"atm callus - FC atm vs. atm Xray",111c,31410901,,29.1700000,,-0.9070602,0.0000000,NO,,0.1086521
TLSPKPPSPR,ph,S,133,true,"atm-3 X-ray callus - FC atm vs. atm Xray",111d,31410901,,29.1700000,,-0.9070602,0.0000000,NO,,0.1086521
TLSPKPPSPR,ph,S,133,true,"Tissue atlas Arabidopsis - ProteomicsDB",114,32188942,"MaxQuant score",142.1000000,1.0000000,,,,2.1090900190757E-6,
SLSPKPPSPR,ph,S,141,true,"Phosphoproteome ethylene-regulated time response",46,24043427,"MASCOT Score",32.2200000,,,,,,16.7327000
SLSPKPPSPR,ph,S,143,true,"Phosphorylation Early Elicitor Signaling",23,17317660,,,,,,,,
SLSPKPPSPR,ph,S,143,true,"Phosphoproteome ethylene-regulated time response",46,24043427,"MASCOT Score",36.3300000,,,,,,9.8208000
SLSPKPPSPR,ph,S,143,true,"srk2dei ABA signaling phopshoproteomics",83,23572148,"MASCOT Score",26.0000000,,,,,,0.0009000
SLSPKPPSPR,ph,S,143,true,"LAXIC - mannitol vs control",84b,23660473,XCorr,2.3000000,0.9430000,,,,0.065211497247219,
SLSPKPPSPR,ph,S,143,true,"SnRK2 protein kinase substrates",85,23776212,XCorr,2.2769139,0.9380000,,,,0.0080125797539949,
SLSPKPPSPR,ph,S,143,true,"atm and atr DNA damage response",88,25561503,"MASCOT Score",31.0000000,1.0000000,,,,,0.2600000
SLSPKPPSPR,ph,S,143,true,"TOR Kinase and ABA Receptor",100,29290610,XCorr,2.5490859,0.9842000,,,,3.3420001273043E-5,
SLSPKPPSPR,ph,S,143,true,"Lateral root-induction - NAA vs control",106,23328941,"MASCOT Score",24.0000000,,,,,,
SLSPKPPSPR,ph,S,143,true,"Phospho cell culture sucrose/TOR",109,30833711,,,0.9997520,,,,,
SLSPKPPSPR,ph,S,143,true,"Col-0 callus - FC Col-0 vs. Col-0 Xray",111a,31410901,,27.5700000,,0.1044467,0.0000000,NO,,0.9971621
SLSPKPPSPR,ph,S,143,true,"Col-0 X-ray callus - FC Col-0 vs. Col-0 Xray",111b,31410901,,27.5700000,,0.1044467,0.0000000,NO,,0.9971621
SLSPKPPSPR,ph,S,143,true,"atm callus - FC atm vs. atm Xray",111c,31410901,,27.5700000,,-0.7433232,0.0000000,NO,,0.9971621
SLSPKPPSPR,ph,S,143,true,"atm-3 X-ray callus - FC atm vs. atm Xray",111d,31410901,,27.5700000,,-0.7433232,0.0000000,NO,,0.9971621
SLSPKPPSPR,ph,S,143,true,"Tissue atlas Arabidopsis - ProteomicsDB",114,32188942,"MaxQuant score",145.8100000,0.9999930,,,,1.2934799542563E-6,
SLSPKPPSPRADLPR,ub,K,145,true,"Arabidopsis ubiquitination by TUBEs",2,23667124,,,,,,,,
SLSPKPPSPR,ph,S,148,true,"Phosphoproteome ethylene-regulated time response",46,24043427,"MASCOT Score",36.3300000,,,,,,9.8208000
SLSPKPPSPR,ph,S,148,true,"srk2dei ABA signaling phopshoproteomics",83,23572148,"MASCOT Score",24.0000000,,,,,,0.0010000
SLSPKPPSPR,ph,S,148,true,"LAXIC - mannitol vs control",84b,23660473,XCorr,2.3000000,1.0000000,,,,0.065211497247219,
SLSPKPPSPR,ph,S,148,true,"SnRK2 protein kinase substrates",85,23776212,XCorr,2.2769139,1.0000000,,,,0.0080125797539949,
SLSPKPPSPR,ph,S,148,true,"atm and atr DNA damage response",88,25561503,"MASCOT Score",32.0000000,1.0000000,,,,,-1.0700000
SLSPKPPSPR,ph,S,148,true,"TOR Kinase and ABA Receptor",100,29290610,XCorr,2.8481803,1.0000000,,,,0.0018820000113919,
SLSPKPPSPR,ph,S,148,true,"Lateral root-induction - NAA vs control",106,23328941,"MASCOT Score",25.0000000,,,,,,
SLSPKPPSPR,ph,S,148,true,"Phospho cell culture sucrose/TOR",109,30833711,,,1.0000000,,,,,
SLSPKPPSPR,ph,S,148,true,"Col-0 callus - FC Col-0 vs. Col-0 Xray",111a,31410901,,26.0900000,,-0.2140225,0.0000000,NO,,-1.1501594
SLSPKPPSPR,ph,S,148,true,"Col-0 X-ray callus - FC Col-0 vs. Col-0 Xray",111b,31410901,,26.0900000,,-0.2140225,0.0000000,NO,,-1.1501594
SLSPKPPSPR,ph,S,148,true,"atm callus - FC atm vs. atm Xray",111c,31410901,,26.0900000,,-1.1797437,0.0000000,NO,,-1.1501594
SLSPKPPSPR,ph,S,148,true,"atm-3 X-ray callus - FC atm vs. atm Xray",111d,31410901,,26.0900000,,-1.1797437,0.0000000,NO,,-1.1501594
SLSPKPPSPR,ph,S,148,true,"Tissue atlas Arabidopsis - ProteomicsDB",114,32188942,"MaxQuant score",147.4200000,1.0000000,,,,1.3935300557932E-6,
SLSPKPFDR,ph,S,156,true,"Phosphoproteome ethylene-regulated time response",46,24043427,"MASCOT Score",38.5900000,,,,,,18.9575000
SLSPKPFDR,ph,S,158,true,"Ethylene-regulated phosphorylation ein2 mutant",30,19253305,"MASCOT Score",35.2941000,,,,,,-1.5183929
SLSPKPFDR,ph,S,158,true,"Phosphoproteome ethylene-regulated time response",46,24043427,"MASCOT Score",42.8700000,,,,,,17.3611000
SLSPKPFDR,ph,S,158,true,"Tyrosine phosphorylation in Arabidopsis",59,18463617,"MASCOT Score",31.0000000,,,,,,-1.1550210
SLSPKPFDR,ph,S,158,true,"Chloroplast kinase substrates",60,19376835,"MASCOT Score",39.4100000,,,,,,0.3260360
SLSPKPFDR,ph,S,158,true,"srk2dei ABA signaling phopshoproteomics",83,23572148,"MASCOT Score",40.0000000,,,,,,-0.0001000
SLSPKPFDR,ph,S,158,true,"atm and atr DNA damage response",88,25561503,"MASCOT Score",34.0000000,0.9920000,,,,,0.4400000
SLSPKPFDR,ph,S,158,true,"Protein sumoylation and phosphorylation cross-talk",97,28419593,,,,,,,,
SLSPKPFDR,ph,S,158,true,"Lateral root-induction - NAA vs control",106,23328941,"MASCOT Score",29.0000000,,,,,,
SLSPKPFDR,ph,S,158,true,"Phospho cell culture sucrose/TOR",109,30833711,,,0.9988800,,,,,
SLSPKPFDR,ph,S,158,true,"Tissue atlas Arabidopsis - ProteomicsDB",114,32188942,"MaxQuant score",124.3900000,1.0000000,,,,0.00034906799555756,
SLSPKPFDR,ph,S,158,true,"Touch-induced phosphorylation: 40s touch vs untouc",136,30291188,"MASCOT score",42.9200000,,0.2659583,0.1776897,NO,,7.1303869
ITPHSVPSPRPSSPR,ph,S,194,true,"srk2dei ABA signaling phopshoproteomics",83,23572148,"MASCOT Score",31.0000000,,,,,,-0.0005000
ITPHSVPSPRPSSPR,ph,S,197,true,"srk2dei ABA signaling phopshoproteomics",83,23572148,"MASCOT Score",32.0000000,,,,,,-0.0004000
ITPHSVPSPRPSSPR,ph,S,197,true,"Brassinosteroid-Regulated Phosphorylation Dynamics",94,26187819,"MaxQuant Score",62.1620000,0.9600000,,,,0.016000000759959,-0.5000000
ITPHSVPSPRPSSPR,ph,S,197,true,"Tissue atlas Arabidopsis - ProteomicsDB",114,32188942,"MaxQuant score",112.9100000,0.9951790,,,,1.3118100241627E-6,
ITPHSVPSPRPSSPR,ph,S,201,true,"srk2dei ABA signaling phopshoproteomics",83,23572148,"MASCOT Score",32.0000000,,,,,,-0.0004000
ITPHSVPSPRPSSPR,ph,S,201,true,"Tissue atlas Arabidopsis - ProteomicsDB",114,32188942,"MaxQuant score",164.9700000,0.8200440,,,,1.1630099823728E-13,
ITPHSVPSPRPSSPR,ph,S,202,true,"srk2dei ABA signaling phopshoproteomics",83,23572148,"MASCOT Score",31.0000000,,,,,,-0.0005000
ITPHSVPSPRPSSPR,ph,S,202,true,"Brassinosteroid-Regulated Phosphorylation Dynamics",94,26187819,"MaxQuant Score",62.1620000,0.8010000,,,,0.016000000759959,-0.5000000
ITPHSVPSPRPSSPR,ph,S,202,true,"TOR Kinase and ABA Receptor",100,29290610,XCorr,3.1005237,0.9302000,,,,0.004763999953866,
GASPQAISSKPPSPR,ph,S,207,true,"LAXIC - mannitol vs control",84b,23660473,XCorr,3.2600000,1.0000000,,,,0.00048058800166473,
GASPQAISSKPPSPR,ph,S,207,true,"SnRK2 protein kinase substrates",85,23776212,XCorr,2.4894366,0.9940000,,,,0.0048178499564528,
GASPQAISSKPPSPR,ph,S,207,true,"atm and atr DNA damage response",88,25561503,"MASCOT Score",51.0000000,1.0000000,,,,,0.6600000
GASPQAISSKPPSPR,ph,S,207,true,"TOR Kinase and ABA Receptor",100,29290610,XCorr,3.8370371,1.0000000,,,,0.00020619999850169,
GASPQAISSKPPSPR,ph,S,207,true,"Lateral root-induction - NAA vs control",106,23328941,"MASCOT Score",31.0000000,,,,,,
GASPQAISSKPPSPR,ph,S,207,true,"Phospho cell culture sucrose/TOR",109,30833711,,,0.9999990,,,,,
GASPQAISSKPPSPR,ph,S,207,true,"Tissue atlas Arabidopsis - ProteomicsDB",114,32188942,"MaxQuant score",199.7500000,1.0000000,,,,1.1384399908606E-34,
GASPQAISSKPPSPR,ph,S,212,true,"TOR Kinase and ABA Receptor",100,29290610,XCorr,3.7636850,0.8865000,,,,0.02474999986589,
GASPQAISSKPPSPR,ph,S,212,true,"Lateral root-induction - NAA vs control",106,23328941,"MASCOT Score",34.0000000,,,,,,
GASPQAISSKPPSPR,ph,S,212,true,"Phospho cell culture sucrose/TOR",109,30833711,,,0.7752810,,,,,
GASPQAISSKPPSPR,ph,S,212,true,"Tissue atlas Arabidopsis - ProteomicsDB",114,32188942,"MaxQuant score",110.8200000,0.8278290,,,,1.0381099855294E-5,
GASPQAISSKPPSPR,ph,S,213,true,"srk2dei ABA signaling phopshoproteomics",83,23572148,"MASCOT Score",26.0000000,,,,,,-0.0017000
GASPQAISSKPPSPR,ph,S,213,true,"LAXIC - mannitol vs control",84b,23660473,XCorr,3.2600000,0.8730000,,,,0.00048058800166473,
GASPQAISSKPPSPR,ph,S,213,true,"atm and atr DNA damage response",88,25561503,"MASCOT Score",41.0000000,0.9990000,,,,,-1.2100000
GASPQAISSKPPSPR,ph,S,213,true,"Phospho cell culture sucrose/TOR",109,30833711,,,0.9200780,,,,,
GASPQAISSKPPSPR,ph,S,213,true,"Tissue atlas Arabidopsis - ProteomicsDB",114,32188942,"MaxQuant score",210.0700000,0.9978490,,,,1.4012984643248E-45,
GASPQAISSKPPSPR,ph,S,217,true,"Phosphorylation Early Elicitor Signaling",23,17317660,,,,,,,,
GASPQAISSKPPSPR,ph,S,217,true,"srk2dei ABA signaling phopshoproteomics",83,23572148,"MASCOT Score",26.0000000,,,,,,-0.0017000
GASPQAISSKPPSPR,ph,S,217,true,"LAXIC - mannitol vs control",84b,23660473,XCorr,3.2600000,0.9780000,,,,0.00048058800166473,
GASPQAISSKPPSPR,ph,S,217,true,"SnRK2 protein kinase substrates",85,23776212,XCorr,2.4894366,1.0000000,,,,0.0048178499564528,
GASPQAISSKPPSPR,ph,S,217,true,"atm and atr DNA damage response",88,25561503,"MASCOT Score",56.0000000,1.0000000,,,,,0.2600000
GASPQAISSKPPSPR,ph,S,217,true,"TOR Kinase and ABA Receptor",100,29290610,XCorr,3.7636850,0.9998000,,,,0.02474999986589,
GASPQAISSKPPSPR,ph,S,217,true,"Lateral root-induction - NAA vs control",106,23328941,"MASCOT Score",37.0000000,,,,,,
GASPQAISSKPPSPR,ph,S,217,true,"Phospho cell culture sucrose/TOR",109,30833711,,,0.9999490,,,,,
GASPQAISSKPPSPR,ph,S,217,true,"Col-0 callus - FC Col-0 vs. Col-0 Xray",111a,31410901,,58.3500000,,-0.6833539,0.0000000,NO,,0.2837433
GASPQAISSKPPSPR,ph,S,217,true,"Col-0 X-ray callus - FC Col-0 vs. Col-0 Xray",111b,31410901,,58.3500000,,-0.6833539,0.0000000,NO,,0.2837433
GASPQAISSKPPSPR,ph,S,217,true,"atm callus - FC atm vs. atm Xray",111c,31410901,,58.3500000,,0.6275525,0.0000000,NO,,0.2837433
GASPQAISSKPPSPR,ph,S,217,true,"atm-3 X-ray callus - FC atm vs. atm Xray",111d,31410901,,58.3500000,,0.6275525,0.0000000,NO,,0.2837433
GASPQAISSKPPSPR,ph,S,217,true,"Tissue atlas Arabidopsis - ProteomicsDB",114,32188942,"MaxQuant score",281.6500000,1.0000000,,,,0,
AEPPTLDTPRPPSPR,ph,T,227,true,"Tissue atlas Arabidopsis - ProteomicsDB",114,32188942,"MaxQuant score",75.9700000,0.8553900,,,,0.00015063400496729,
AEPPTLDTPRPPSPR,ph,S,232,true,"STN8 phosphoproteome",38,21768351,"MASCOT Score",61.8800000,,,,,,-1.0546500
AEPPTLDTPRPPSPR,ph,S,232,true,"Chloroplast kinase substrates",60,19376835,"MASCOT Score",44.4200000,,,,,,-0.4471140
AEPPTLDTPRPPSPR,ph,S,232,true,"SnRK2 protein kinase substrates",85,23776212,XCorr,2.6340027,0.9990000,,,,0.0018831200432032,
AEPPTLDTPRPPSPR,ph,S,232,true,"atm and atr DNA damage response",88,25561503,"MASCOT Score",37.0000000,1.0000000,,,,,0.5700000
AEPPTLDTPRPPSPR,ph,S,232,true,"TOR Kinase and ABA Receptor",100,29290610,XCorr,3.2088046,0.9998000,,,,1.0439999641676E-5,
AEPPTLDTPRPPSPR,ph,S,232,true,"Lateral root-induction - NAA vs control",106,23328941,"MASCOT Score",25.0000000,,,,,,
AEPPTLDTPRPPSPR,ph,S,232,true,"Tissue atlas Arabidopsis - ProteomicsDB",114,32188942,"MaxQuant score",211.2000000,1.0000000,,,,1.4012984643248E-45,
AASLRADPPR,ph,S,237,true,"Tissue atlas Arabidopsis - ProteomicsDB",114,32188942,"MaxQuant score",85.5220000,1.0000000,,,,0.00050114199984819,
LDAARPTTPRPPSPLADAPR,ph,T,251,true,"TOR Kinase and ABA Receptor",100,29290610,XCorr,3.3709564,0.9807000,,,,0.003224000101909,
LDAARPTTPRPPSPLADAPR,ph,T,251,true,"Tissue atlas Arabidopsis - ProteomicsDB",114,32188942,"MaxQuant score",133.7600000,0.9348640,,,,1.8720700732305E-21,
PTTPRPPSPLADAPR,ph,T,251,true,"atm and atr DNA damage response",88,25561503,"MASCOT Score",21.0000000,0.9900000,,,,,0.2900000
LDAARPTTPRPPSPLADAPR,ph,T,252,true,"PAMP-triggered phosphorylation",48,24601666,"MASCOT Score",22.6600000,,,,,,
PTTPRPPSPLADAPR,ph,T,252,true,"Tissue atlas Arabidopsis - ProteomicsDB",114,32188942,"MaxQuant score",188.9600000,0.9997240,,,,1.4813199263361E-26,
LDAARPTTPRPPSPLADAPR,ph,S,257,true,"Large-scale phosphorylation discovery",44,23111157,XCorr,2.9450000,,,,,,
LDAARPTTPRPPSPLADAPR,ph,S,257,true,"PAMP-triggered phosphorylation",48,24601666,"MASCOT Score",22.6600000,,,,,,
LDAARPTTPRPPSPLADAPR,ph,S,257,true,"SnRK2 protein kinase substrates",85,23776212,XCorr,2.8276589,1.0000000,,,,0.0015063199680299,
LDAARPTTPRPPSPLADAPR,ph,S,257,true,"TOR Kinase and ABA Receptor",100,29290610,XCorr,3.3709564,0.9999000,,,,0.003224000101909,
LDAARPTTPRPPSPLADAPR,ph,S,257,true,"Phospho cell culture sucrose/TOR",109,30833711,,,0.9997010,,,,,
PTTPRPPSPLADAPR,ph,S,257,true,"atm and atr DNA damage response",88,25561503,"MASCOT Score",30.0000000,1.0000000,,,,,0.5200000
PTTPRPPSPLADAPR,ph,S,257,true,"Tissue atlas Arabidopsis - ProteomicsDB",114,32188942,"MaxQuant score",153.1000000,0.9999970,,,,1.8196199673117E-25,
LDAPRPTTPKPPSPR,ph,T,271,true,"Phosphorylation Early Elicitor Signaling",23,17317660,,,,,,,,
LDAPRPTTPKPPSPR,ph,T,271,true,"srk2dei ABA signaling phopshoproteomics",83,23572148,"MASCOT Score",25.0000000,,,,,,-0.0002000
LDAPRPTTPKPPSPR,ph,T,271,true,"Col-0 callus - FC Col-0 vs. Col-0 Xray",111a,31410901,,25.1800000,,-0.1604631,0.0000000,NO,,2.5404379
LDAPRPTTPKPPSPR,ph,T,271,true,"Col-0 X-ray callus - FC Col-0 vs. Col-0 Xray",111b,31410901,,25.1800000,,-0.1604631,0.0000000,NO,,2.5404379
LDAPRPTTPKPPSPR,ph,T,271,true,"atm callus - FC atm vs. atm Xray",111c,31410901,,25.1800000,,-0.8029707,0.0000000,NO,,2.5404379
LDAPRPTTPKPPSPR,ph,T,271,true,"atm-3 X-ray callus - FC atm vs. atm Xray",111d,31410901,,25.1800000,,-0.8029707,0.0000000,NO,,2.5404379
LDAPRPTTPKPPSPR,ph,T,271,true,"Tissue atlas Arabidopsis - ProteomicsDB",114,32188942,"MaxQuant score",118.7200000,0.7899980,,,,1.4413400094782E-5,
LDAPRPTTPKPPSPR,ph,T,272,true,"srk2dei ABA signaling phopshoproteomics",83,23572148,"MASCOT Score",28.0000000,,,,,,-0.0001000
LDAPRPTTPKPPSPR,ph,T,272,true,"SnRK2 protein kinase substrates",85,23776212,XCorr,2.9652889,0.9140000,,,,4.4683598389383E-5,
LDAPRPTTPKPPSPR,ph,T,272,true,"TOR Kinase and ABA Receptor",100,29290610,XCorr,3.4081118,0.9060000,,,,2.9110000468791E-5,
LDAPRPTTPKPPSPR,ph,T,272,true,"Phospho cell culture sucrose/TOR",109,30833711,,,0.8383090,,,,,
LDAPRPTTPKPPSPR,ph,T,272,true,"Col-0 callus - FC Col-0 vs. Col-0 Xray",111a,31410901,,22.7800000,,0.7875570,0.0000000,NO,,1.4258498
LDAPRPTTPKPPSPR,ph,T,272,true,"Col-0 X-ray callus - FC Col-0 vs. Col-0 Xray",111b,31410901,,22.7800000,,0.7875570,0.0000000,NO,,1.4258498
LDAPRPTTPKPPSPR,ph,T,272,true,"atm callus - FC atm vs. atm Xray",111c,31410901,,22.7800000,,1.2596749,0.0000000,NO,,1.4258498
LDAPRPTTPKPPSPR,ph,T,272,true,"atm-3 X-ray callus - FC atm vs. atm Xray",111d,31410901,,22.7800000,,1.2596749,0.0000000,NO,,1.4258498
PTTPKPPSPR,ph,T,272,true,"atm and atr DNA damage response",88,25561503,"MASCOT Score",27.0000000,1.0000000,,,,,-0.7800000
PTTPKPPSPR,ph,T,272,true,"Tissue atlas Arabidopsis - ProteomicsDB",114,32188942,"MaxQuant score",148.6200000,0.9974560,,,,8.1842500776474E-8,
LDAPRPTTPKPPSPR,ph,S,277,true,"Phosphorylation Early Elicitor Signaling",23,17317660,,,,,,,,
LDAPRPTTPKPPSPR,ph,S,277,true,"PAMP-triggered phosphorylation",48,24601666,"MASCOT Score",27.1800000,,,,,,
LDAPRPTTPKPPSPR,ph,S,277,true,"srk2dei ABA signaling phopshoproteomics",83,23572148,"MASCOT Score",28.0000000,,,,,,-0.0001000
LDAPRPTTPKPPSPR,ph,S,277,true,"LAXIC - ABA stress",84a,23660473,XCorr,2.0000000,0.9370000,,,,0.29109299182892,
LDAPRPTTPKPPSPR,ph,S,277,true,"SnRK2 protein kinase substrates",85,23776212,XCorr,2.9652889,1.0000000,,,,4.4683598389383E-5,
LDAPRPTTPKPPSPR,ph,S,277,true,"atm and atr DNA damage response",88,25561503,"MASCOT Score",24.0000000,1.0000000,,,,,-0.1200000
LDAPRPTTPKPPSPR,ph,S,277,true,"TOR Kinase and ABA Receptor",100,29290610,XCorr,3.4081118,1.0000000,,,,2.9110000468791E-5,
LDAPRPTTPKPPSPR,ph,S,277,true,"Phospho cell culture sucrose/TOR",109,30833711,,,0.9999990,,,,,
LDAPRPTTPKPPSPR,ph,S,277,true,"Col-0 callus - FC Col-0 vs. Col-0 Xray",111a,31410901,,30.4000000,,0.0893021,0.0000000,NO,,0.0288338
LDAPRPTTPKPPSPR,ph,S,277,true,"Col-0 X-ray callus - FC Col-0 vs. Col-0 Xray",111b,31410901,,30.4000000,,0.0893021,0.0000000,NO,,0.0288338
LDAPRPTTPKPPSPR,ph,S,277,true,"atm callus - FC atm vs. atm Xray",111c,31410901,,30.4000000,,0.5662681,0.0000000,NO,,0.0288338
LDAPRPTTPKPPSPR,ph,S,277,true,"atm-3 X-ray callus - FC atm vs. atm Xray",111d,31410901,,30.4000000,,0.5662681,0.0000000,NO,,0.0288338
PTTPKPPSPR,ph,S,277,true,"atm and atr DNA damage response",88,25561503,"MASCOT Score",32.0000000,1.0000000,,,,,-0.2900000
PTTPKPPSPR,ph,S,277,true,"Tissue atlas Arabidopsis - ProteomicsDB",114,32188942,"MaxQuant score",156.6700000,1.0000000,,,,1.1194299610537E-12,
LDAPRPTTPKPPSPR,ph,T,291,true,"Phosphorylation Early Elicitor Signaling",23,17317660,,,,,,,,
LDAPRPTTPKPPSPR,ph,T,291,true,"srk2dei ABA signaling phopshoproteomics",83,23572148,"MASCOT Score",25.0000000,,,,,,-0.0002000
LDAPRPTTPKPPSPR,ph,T,291,true,"Col-0 callus - FC Col-0 vs. Col-0 Xray",111a,31410901,,25.1800000,,-0.1604631,0.0000000,NO,,2.5404379