Peptide,PTM,ModifiedAA,ModifiedPosition,PeptideUniqueToGene,ExperimentDesc,ExpID,PubmedID,ScoreType,IdentScore,LocProb,Log2FChange,PQ-val,QuantSig,PEP,MassErrorPPM
GKKGGTLKR,ub,K,4,true,"Arabidopsis ubiquitination COFRADIC",40,26744219,"MaxQuant Score",54.2590000,0.9670000,,,,0.0089999996125698,1.1110000
SGLYHSGDNVDFDILSSDDEDIKAEEEEVIR,ph,S,141,true,"Arabidopsis root NAA phosphoproteome",18a,27643528,"MaxQuant Score",70.7810000,1.0000000,,,,1.8279999736137E-8,0.0510000
SGLYHSGDNVDFDILSSDDEDIKAEEEEVIR,ph,S,141,true,"SnRK2 protein kinase substrates",85,23776212,XCorr,5.9486680,0.9240000,,,,0.0023361600469798,
SGLYHSGDNVDFDILSSDDEDIKAEEEEVIR,ph,S,141,true,"Brassinosteroid-Regulated Phosphorylation Dynamics",94,26187819,"MaxQuant Score",161.5100000,1.0000000,,,,4.6000000246274E-17,1.7540000
SGLYHSGDNVDFDILSSDDEDIKAEEEEVIR,ph,S,141,true,"Col-0 callus - FC Col-0 vs. Col-0 Xray",111a,31410901,,66.4900000,,0.4094831,0.0000000,NO,,1.5970235
SGLYHSGDNVDFDILSSDDEDIKAEEEEVIR,ph,S,141,true,"Col-0 X-ray callus - FC Col-0 vs. Col-0 Xray",111b,31410901,,66.4900000,,0.4094831,0.0000000,NO,,1.5970235
SGLYHSGDNVDFDILSSDDEDIKAEEEEVIR,ph,S,141,true,"atm callus - FC atm vs. atm Xray",111c,31410901,,66.4900000,,-0.8398251,0.0000000,NO,,1.5970235
SGLYHSGDNVDFDILSSDDEDIKAEEEEVIR,ph,S,141,true,"atm-3 X-ray callus - FC atm vs. atm Xray",111d,31410901,,66.4900000,,-0.8398251,0.0000000,NO,,1.5970235
SGLYHSGDNVDFDILSSDDEDIKAEEEEVIR,ph,S,141,true,"Tissue atlas Arabidopsis - ProteomicsDB",114,32188942,"MaxQuant score",121.9200000,0.9999960,,,,7.0064923216241E-45,
SGLYHSGDNVDFDILSSDDEDIK,ph,S,141,true,"srk2dei ABA signaling phopshoproteomics",83,23572148,"MASCOT Score",31.0000000,,,,,,0.0016000
SGLYHSGDNVDFDILSSDDEDIK,ph,S,141,true,"TOR Kinase and ABA Receptor",100,29290610,XCorr,6.1426544,1.0000000,,,,2.0350000795588E-6,
SGLYHSGDNVDFDILSSDDEDIK,ph,S,141,true,"Phospho cell culture sucrose/TOR",109,30833711,,,1.0000000,,,,,
SGLYHSGDNVDFDILSSDDEDIKAEEEEVIR,ph,S,142,true,"Arabidopsis root NAA phosphoproteome",18a,27643528,"MaxQuant Score",70.7810000,1.0000000,,,,1.8279999736137E-8,0.0510000
SGLYHSGDNVDFDILSSDDEDIKAEEEEVIR,ph,S,142,true,"Brassinosteroid-Regulated Phosphorylation Dynamics",94,26187819,"MaxQuant Score",161.5100000,1.0000000,,,,4.6000000246274E-17,1.7540000
SGLYHSGDNVDFDILSSDDEDIKAEEEEVIR,ph,S,142,true,"Col-0 callus - FC Col-0 vs. Col-0 Xray",111a,31410901,,66.4900000,,0.4094831,0.0000000,NO,,1.5970235
SGLYHSGDNVDFDILSSDDEDIKAEEEEVIR,ph,S,142,true,"Col-0 X-ray callus - FC Col-0 vs. Col-0 Xray",111b,31410901,,66.4900000,,0.4094831,0.0000000,NO,,1.5970235
SGLYHSGDNVDFDILSSDDEDIKAEEEEVIR,ph,S,142,true,"atm callus - FC atm vs. atm Xray",111c,31410901,,66.4900000,,-0.8398251,0.0000000,NO,,1.5970235
SGLYHSGDNVDFDILSSDDEDIKAEEEEVIR,ph,S,142,true,"atm-3 X-ray callus - FC atm vs. atm Xray",111d,31410901,,66.4900000,,-0.8398251,0.0000000,NO,,1.5970235
SGLYHSGDNVDFDILSSDDEDIKAEEEEVIR,ph,S,142,true,"Tissue atlas Arabidopsis - ProteomicsDB",114,32188942,"MaxQuant score",121.9200000,0.9999990,,,,7.0064923216241E-45,
SGLYHSGDNVDFDILSSDDEDIK,ph,S,142,true,"srk2dei ABA signaling phopshoproteomics",83,23572148,"MASCOT Score",31.0000000,,,,,,0.0016000
SGLYHSGDNVDFDILSSDDEDIK,ph,S,142,true,"TOR Kinase and ABA Receptor",100,29290610,XCorr,6.1426544,1.0000000,,,,2.0350000795588E-6,
LRAEQLGSITAADAGLDDDSEEDSDRELTMEEISDK,ph,S,176,true,"Brassinosteroid-Regulated Phosphorylation Dynamics",94,26187819,"MaxQuant Score",147.8500000,1.0000000,,,,7.1120000066388E-37,2.0060000
LRAEQLGSITAADAGLDDDSEEDSDRELTMEEISDK,ph,S,176,true,"TOR Kinase and ABA Receptor",100,29290610,XCorr,5.7353044,0.9027000,,,,0.0045659998431802,
LRAEQLGSITAADAGLDDDSEEDSDRELTMEEISDK,ph,S,176,true,"Phospho cell culture sucrose/TOR",109,30833711,,,0.9978450,,,,,
LRAEQLGSITAADAGLDDDSEEDSDRELTMEEISDK,ph,S,176,true,"Tissue atlas Arabidopsis - ProteomicsDB",114,32188942,"MaxQuant score",186.1600000,0.9969610,,,,0,
AEQLGSITAADAGLDDDSEEDSDRELTMEEISDK,ph,S,176,true,"TOR Kinase and ABA Receptor",100,29290610,XCorr,4.5824599,0.7654000,,,,0.00013070000568405,
LRAEQLGSITAADAGLDDDSEEDSDRELTMEEISDK,ph,S,180,true,"Brassinosteroid-Regulated Phosphorylation Dynamics",94,26187819,"MaxQuant Score",147.8500000,0.9970000,,,,7.1120000066388E-37,-1.4850000
LRAEQLGSITAADAGLDDDSEEDSDRELTMEEISDK,ph,S,180,true,"Phospho cell culture sucrose/TOR",109,30833711,,,0.9847020,,,,,
LRAEQLGSITAADAGLDDDSEEDSDRELTMEEISDK,ph,S,180,true,"Tissue atlas Arabidopsis - ProteomicsDB",114,32188942,"MaxQuant score",186.1600000,0.8704380,,,,0,
LRAEQLGSITAADAGLDDDSEEDSDRELTMEEISDK,ph,T,185,true,"Brassinosteroid-Regulated Phosphorylation Dynamics",94,26187819,"MaxQuant Score",104.8300000,0.7600000,,,,5.070999870016E-11,1.9950000
LRAEQLGSITAADAGLDDDSEEDSDRELTMEEISDK,ph,T,185,true,"Phospho cell culture sucrose/TOR",109,30833711,,,0.7543710,,,,,
ELTMEEISDK,ph,S,190,true,"Tissue atlas Arabidopsis - ProteomicsDB",114,32188942,"MaxQuant score",138.8900000,1.0000000,,,,8.597439773439E-6,
VVKEDQLTSPVSDSVDR,ph,S,359,true,"SnRK2 protein kinase substrates",85,23776212,XCorr,4.3611059,0.9740000,,,,4.6039200242376E-5,
VVKEDQLTSPVSDSVDR,ph,S,359,true,"atm and atr DNA damage response",88,25561503,"MASCOT Score",24.0000000,0.9950000,,,,,1.9800000
VVKEDQLTSPVSDSVDR,ph,S,359,true,"Col-0 callus - FC Col-0 vs. Col-0 Xray",111a,31410901,,46.5100000,,-0.0132259,0.0000000,NO,,0.3008506
VVKEDQLTSPVSDSVDR,ph,S,359,true,"Col-0 X-ray callus - FC Col-0 vs. Col-0 Xray",111b,31410901,,46.5100000,,-0.0132259,0.0000000,NO,,0.3008506
VVKEDQLTSPVSDSVDR,ph,S,359,true,"atm callus - FC atm vs. atm Xray",111c,31410901,,46.5100000,,-0.0114100,0.0000000,NO,,0.3008506
VVKEDQLTSPVSDSVDR,ph,S,359,true,"atm-3 X-ray callus - FC atm vs. atm Xray",111d,31410901,,46.5100000,,-0.0114100,0.0000000,NO,,0.3008506
VVKEDQLTSPVSDSVDR,ph,S,359,true,"Touch-induced phosphorylation: 40s touch vs untouc",136,30291188,"MASCOT score",97.5400000,,-0.0657753,0.6803076,NO,,4.5655781
EDQLTSPVSDSVDR,ph,S,359,true,"Arabidopsis root NAA phosphoproteome",18a,27643528,"MaxQuant Score",76.5860000,0.8870000,,,,1.5029999644867E-7,0.8990000
EDQLTSPVSDSVDR,ph,S,359,true,"Large-scale phosphorylation discovery",44,23111157,XCorr,3.6560000,,,,,,
EDQLTSPVSDSVDR,ph,S,359,true,"Tyrosine phosphorylation in Arabidopsis",59,18463617,"MASCOT Score",68.0000000,,,,,,0.0000000
EDQLTSPVSDSVDR,ph,S,359,true,"srk2dei ABA signaling phopshoproteomics",83,23572148,"MASCOT Score",64.0000000,,,,,,-0.0003000
EDQLTSPVSDSVDR,ph,S,359,true,"LAXIC - mannitol vs control",84b,23660473,XCorr,2.7400000,0.9880000,-1.4991894,,NO,1.2999999853491E-5,
EDQLTSPVSDSVDR,ph,S,359,true,"SnRK2 protein kinase substrates",85,23776212,XCorr,2.0677645,0.9930000,,,,0.06540510058403,
EDQLTSPVSDSVDR,ph,S,359,true,"atm and atr DNA damage response",88,25561503,"MASCOT Score",65.0000000,0.9990000,,,,,0.2300000
EDQLTSPVSDSVDR,ph,S,359,true,"TOR Kinase and ABA Receptor",100,29290610,XCorr,3.5868969,0.9390000,,,,8.2579999798327E-6,
EDQLTSPVSDSVDR,ph,S,359,true,"Phospho cell culture sucrose/TOR",109,30833711,,,0.9978110,,,,,
EDQLTSPVSDSVDR,ph,S,359,true,"Tissue atlas Arabidopsis - ProteomicsDB",114,32188942,"MaxQuant score",298.3300000,0.9999410,,,,0,
VVKEDQLTSPVSDSVDR,ph,S,362,true,"SnRK2 protein kinase substrates",85,23776212,XCorr,2.8742402,1.0000000,,,,0.00067657697945833,
VVKEDQLTSPVSDSVDR,ph,S,362,true,"Tissue atlas Arabidopsis - ProteomicsDB",114,32188942,"MaxQuant score",250.9800000,0.9998560,,,,0,
EDQLTSPVSDSVDR,ph,S,362,true,"atm and atr DNA damage response",88,25561503,"MASCOT Score",65.0000000,1.0000000,,,,,0.2300000
VVKEDQLTSPVSDSVDR,ph,S,364,true,"Tissue atlas Arabidopsis - ProteomicsDB",114,32188942,"MaxQuant score",216.3200000,0.9985000,,,,0,
EDQLTSPVSDSVDR,ph,S,364,true,"atm and atr DNA damage response",88,25561503,"MASCOT Score",69.0000000,0.9970000,,,,,-0.3700000
EEKKKKGEKR,ac,K,385,true,"Quantitative Acetylproteomics",101,29440448,,,,,,,,
EEKKKKGEKR,ac,K,386,true,"Quantitative Acetylproteomics",101,29440448,,,,,,,,
EEKKKKGEKR,ac,K,387,true,"Quantitative Acetylproteomics",101,29440448,,,,,,,,
EEKKKKGEKR,ac,K,388,true,"Quantitative Acetylproteomics",101,29440448,,,,,,,,
EEKKKKGEKR,ac,K,391,true,"Quantitative Acetylproteomics",101,29440448,,,,,,,,
KLETFDDYVDDADNSTHNVTADK,ph,S,457,true,"Tissue atlas Arabidopsis - ProteomicsDB",114,32188942,"MaxQuant score",138.1900000,0.8783230,,,,6.473939781052E-30,
KPKTISGDDDLPQR,ub,K,475,true,"Arabidopsis ubiquitination COFRADIC",40,26744219,"MaxQuant Score",40.2780000,0.9410000,,,,0.0070000002160668,0.3660000
KPKTISGDDDLPQR,ub,K,477,true,"Arabidopsis ubiquitination COFRADIC",40,26744219,"MaxQuant Score",123.2900000,0.9450000,,,,1.4900000496509E-19,0.7420000
VLAGAGVKSSEGDGR,ub,K,509,true,"Arabidopsis ubiquitination COFRADIC",40,26744219,"MaxQuant Score",87.5190000,1.0000000,,,,1.7639999327912E-7,-0.1570000
NGAFASDDEDDNDGDNNDMVDNDGESEDEFYK,ph,S,524,true,"TOR Kinase and ABA Receptor",100,29290610,XCorr,6.1056142,1.0000000,,,,2.128000051016E-5,
NGAFASDDEDDNDGDNNDMVDNDGESEDEFYK,ph,S,544,true,"TOR Kinase and ABA Receptor",100,29290610,XCorr,6.1056142,0.9632000,,,,2.128000051016E-5,
KPHLMPSSPEHVDGK,ph,S,576,true,"Tyrosine phosphorylation in Arabidopsis",59,18463617,"MASCOT Score",45.0000000,,,,,,-0.9207100
KPHLMPSSPEHVDGK,ph,S,576,true,"srk2dei ABA signaling phopshoproteomics",83,23572148,"MASCOT Score",36.0000000,,,,,,-0.0016000
KPHLMPSSPEHVDGK,ph,S,576,true,"Phospho cell culture sucrose/TOR",109,30833711,,,0.8012810,,,,,
KPHLMPSSPEHVDGK,ph,S,576,true,"Tissue atlas Arabidopsis - ProteomicsDB",114,32188942,"MaxQuant score",104.6800000,0.8115900,,,,2.3158600015449E-6,
KPHLMPSSPEHVDGK,ph,S,577,true,"srk2dei ABA signaling phopshoproteomics",83,23572148,"MASCOT Score",33.0000000,,,,,,0.0001000
KPHLMPSSPEHVDGK,ph,S,577,true,"atm and atr DNA damage response",88,25561503,"MASCOT Score",28.0000000,1.0000000,,,,,-1.1900000
KPHLMPSSPEHVDGK,ph,S,577,true,"Phospho cell culture sucrose/TOR",109,30833711,,,0.9732680,,,,,
KPHLMPSSPEHVDGK,ph,S,577,true,"Tissue atlas Arabidopsis - ProteomicsDB",114,32188942,"MaxQuant score",185.8500000,0.9975120,,,,2.8098399220026E-27,
KNYEKKVTR,ub,K,618,true,"Arabidopsis ubiquitination COFRADIC",40,26744219,"MaxQuant Score",85.8130000,0.9680000,,,,0.0010000000474975,0.0640000
