Peptide,PTM,ModifiedAA,ModifiedPosition,PeptideUniqueToGene,ExperimentDesc,ExpID,PubmedID,ScoreType,IdentScore,LocProb,Log2FChange,PQ-val,QuantSig,PEP,MassErrorPPM
PKQIHEIKDFLLTAR,nt,P,2,false,"Arabidopsis translation initiation landscape - NT",167b,35069635,,,,,,,,
PKQIHEIKDFLLTAR,nta,P,2,false,"Arg/N-end rule pathway Roots",80,25728785,"MASCOT Score",47.9500000,,,,,0.0013310000067577,
EIKDFLLTAR,nt,E,7,false,"Metacaspase9 substrates - 35S:MC9 / mc9",51b,23964026,"MASCOT Score",66.0000000,,1.1953267,,NO,,-1.5523426
QIHEIKDFLLTAR,ac,K,9,false,"Histone deacetylases - apicidin vs control",98a,29061669,"MaxQuant Score",129.5000000,1.0000000,0.0280000,0.8953648,NO,7.3000000488932E-10,
QIHEIKDFLLTAR,ac,K,9,false,"Histone deacetylases substrates - hda14 vs WT",98e,29061669,"MaxQuant Score",83.7000000,1.0000000,-0.0920000,0.9099133,NO,2.1999999262334E-6,
SKDIVKFK,ac,K,33,false,"Quantitative Acetylproteomics",101,29440448,,,,,,,,
SKDIVKFKVR,ub,K,35,false,"Arabidopsis ubiquitination COFRADIC",40,26744219,"MaxQuant Score",51.2860000,0.8520000,,,,0.0040000001899898,-0.2540000
YLYTLCVFDQEK,acy,C,46,false,"Arabidopsis S-acylation atlas - Silique",163e,35681017,,,,,,,,
YLYTLCVFDQEKADK,so,C,46,false,"S-sulfenylation site detection using YAP1C",110,32714340,,,,,,,,
YLYTLCVFDQEKADK,ac,K,52,false,"Histone deacetylases substrates - hda14 vs WT",98e,29061669,"MaxQuant Score",60.6000000,1.0000000,0.0560000,0.9289664,NO,0.00025000001187436,
QSLPPGLSVQDL,ph,S,65,false,"atm and atr DNA damage response",88,25561503,"MASCOT Score",24.0000000,1.0000000,,,,,-0.5300000
