Peptide,PTM,ModifiedAA,ModifiedPosition,PeptideUniqueToGene,ExperimentDesc,ExpID,PubmedID,ScoreType,IdentScore,LocProb,Log2FChange,PQ-val,QuantSig,PEP,MassErrorPPM
TQIPSPPR,ph,S,208,true,"TOR Kinase and ABA Receptor",100,29290610,XCorr,2.5310333,1.0000000,,,,0.001479999977164,
TQIPSPPR,ph,S,208,true,"Phospho cell culture sucrose/TOR",109,30833711,,,0.9999990,,,,,
TQIPSPPR,ph,S,208,true,"Tissue atlas Arabidopsis - ProteomicsDB",114,32188942,"MaxQuant score",111.6100000,1.0000000,,,,0.00038128299638629,
KGSVSDREEEYYR,ph,S,215,true,"Tissue atlas Arabidopsis - ProteomicsDB",114,32188942,"MaxQuant score",53.5360000,0.9999670,,,,0.011068800464272,
KGSVSDREEEYYR,ph,S,217,true,"Tissue atlas Arabidopsis - ProteomicsDB",114,32188942,"MaxQuant score",89.5060000,0.9998330,,,,0.00011235500278417,
EKSSVEREEEFK,ph,S,228,true,"Tissue atlas Arabidopsis - ProteomicsDB",114,32188942,"MaxQuant score",87.6690000,1.0000000,,,,0.00032138999085873,
SSVEREEEFKER,ph,S,229,true,"Phospho cell culture sucrose/TOR",109,30833711,,,0.8287370,,,,,
EKSSVEREEEFK,ph,S,229,true,"Tissue atlas Arabidopsis - ProteomicsDB",114,32188942,"MaxQuant score",87.6690000,1.0000000,,,,0.00032138999085873,
