Peptide,PTM,ModifiedAA,ModifiedPosition,PeptideUniqueToGene,ExperimentDesc,ExpID,PubmedID,ScoreType,IdentScore,LocProb,Log2FChange,PQ-val,QuantSig,PEP,MassErrorPPM
YSSLSAASAEAER,nt,Y,26,true,"Arg/N-end rule pathway Roots",80,25728785,"MASCOT Score",77.3000000,,,,,2.0340000617125E-7,
YSSLSAASAEAER,nt,Y,26,true,"N-terminal ChaFRADIC",92,26010716,"MASCOT Score",40.4600000,,,,,1.7579999678219E-7,
YSSLSAASAEAER,nt,Y,26,true,"FtsH12 N-terminome: WT / FtsH12 knockdown miRNA",118,33216923,"MaxQuant score",89.4030000,,-0.3311230,0.0868863,NO,4.8299998667289E-8,
YSSLSAASAEAER,nt,Y,26,true,"Mitochondrial intermediate peptidases - icp55 / WT",131a,25732537,,86.8000000,,0.7300452,,,,
YSSLSAASAEAER,nt,Y,26,true,"Mitochondrial intermediate peptidases - oct1-1 / WT",131b,25732537,,84.0900000,,-0.0045264,,,,
YSSLSAASAEAER,nt,Y,26,true,"Mitochondrial intermediate peptidases - oct1-2 / WT",131c,25732537,,98.4100000,,-0.1852099,,,,
YSSLSAASAEAER,nt,Y,26,true,"Arabidopsis translation initiation landscape - NT",167b,35069635,,,,,,,,
YSSLSAASAEAE,nt,Y,26,true,"N-terminal ChaFRADIC",92,26010716,"MASCOT Score",40.8900000,,,,,0.0025450000539422,
SSLSAASAEAER,nt,S,27,true,"Arg/N-end rule pathway Roots",80,25728785,"MASCOT Score",89.8600000,,,,,1.8730000306277E-7,
SSLSAASAEAER,nt,S,27,true,"Tic56 chloroplast import - ppi2",89b,25588737,XCorr,3.5273142,,,,,,
SSLSAASAEAER,nt,S,27,true,"Tic56 chloroplast import - tic56-1",89c,25588737,XCorr,3.5395901,,,,,,
SSLSAASAEAER,nt,S,27,true,"N-terminal ChaFRADIC",92,26010716,"MASCOT Score",37.4000000,,,,,0.0010829999810085,
SSLSAASAEAER,nt,S,27,true,"Arg/N-end rule seed, prt6 vs. Wt",99,29168982,"MASCOT Score",70.4800000,,-0.1610510,0.2812327,NO,0.0004248000041116,-1.9464848
SSLSAASAEAER,nt,S,27,true,"FtsH12 N-terminome: WT / FtsH12 knockdown miRNA",118,33216923,"MaxQuant score",125.9700000,,-0.5906848,0.0230684,YES,7.5300002457155E-20,
SSLSAASAEAER,nt,S,27,true,"Mitochondrial intermediate peptidases - icp55 / WT",131a,25732537,,99.6000000,,-6.6438562,,,,
SSLSAASAEAER,nt,S,27,true,"Mitochondrial intermediate peptidases - oct1-1 / WT",131b,25732537,,89.4300000,,-0.2967503,,,,
SSLSAASAEAER,nt,S,27,true,"Mitochondrial intermediate peptidases - oct1-2 / WT",131c,25732537,,88.0600000,,-0.1148258,,,,
SSLSAASAEAER,nt,S,27,true,"Arabidopsis translation initiation landscape - NT",167b,35069635,,,,,,,,
SSLSAASAEAE,nt,S,27,true,"N-terminal ChaFRADIC",92,26010716,"MASCOT Score",48.2400000,,,,,0.00048570000217296,
EVQQCTLLSIK,ox,C,84,true,"Redox kickstart of mitochondria",112,31871212,,,,-1.2710553,0.0000001,YES,,
EVQQCTLLSIK,sno,C,84,true,"hot5-4 / wildtype, FAT-switch S-nitrosoproteome",169,37277371,,,,-0.2426848,0.4267933,NO,,
EVQQCTLLSIK,so,C,84,true,"Arabidopsis S-sulfenylation chemoproteomics",108,31578252,"pFind PSM Score",0.0124810,,1.1383600,,,,-0.8885822
TGGCSEDCSYCPQSSR,ox,C,94,true,"OxiTRAQ Arabidopsis - 5 mM H2O2 versus control",47,24376095,,,,1.2312172,0.0092985,YES,,
TGGCSEDCSYCPQSSR,ox,C,98,true,"OxiTRAQ Arabidopsis - 5 mM H2O2 versus control",47,24376095,,,,1.2312172,0.0092985,YES,,
TGGCSEDCSYCPQSSR,ox,C,101,true,"OxiTRAQ Arabidopsis - 5 mM H2O2 versus control",47,24376095,,,,1.2312172,0.0092985,YES,,
AQRLMSK,mox,M,117,true,"cat2 Methionine oxidation - 1h stress",62a,25693801,"MASCOT Score",39.0000000,,-0.4148087,,NO,,
AQRLMSK,mox,M,117,true,"cat2 Methionine oxidation - 3h stress",62b,25693801,"MASCOT Score",34.0000000,,-0.0696731,,NO,,
FCMGAAWR,ox,C,138,true,"Redox kickstart of mitochondria",112,31871212,,,,-1.0033435,0.0000013,YES,,
FSMSEQALCFLAGANSIFTGEK,ox,C,319,true,"Redox kickstart of mitochondria",112,31871212,,,,-1.4310202,0.0044846,YES,,
TLGLIPKPPSFSEDDSESENCEK,ph,S,361,true,"srk2dei ABA signaling phopshoproteomics",83,23572148,"MASCOT Score",25.0000000,,,,,,0.0014000
TLGLIPKPPSFSEDDSESENCEK,ph,S,365,true,"Conserved plant phosphoproteome - Arabidopsis",61a,20466843,"MASCOT Score",55.0000000,1.0000000,,,,,
TLGLIPKPPSFSEDDSESENCEK,ph,S,365,true,"SnRK2 protein kinase substrates",85,23776212,XCorr,2.6848266,0.9600000,,,,0.0025075399316847,
TLGLIPKPPSFSEDDSESENCEK,ph,S,365,true,"Phospho cell culture sucrose/TOR",109,30833711,,,0.9545110,,,,,
TLGLIPKPPSFSEDDSESENCEK,ph,S,365,true,"Col-0 callus - FC Col-0 vs. Col-0 Xray",111a,31410901,,25.6700000,,0.5241480,0.0000000,NO,,0.9136338
TLGLIPKPPSFSEDDSESENCEK,ph,S,365,true,"Col-0 X-ray callus - FC Col-0 vs. Col-0 Xray",111b,31410901,,25.6700000,,0.5241480,0.0000000,NO,,0.9136338
TLGLIPKPPSFSEDDSESENCEK,ph,S,365,true,"atm callus - FC atm vs. atm Xray",111c,31410901,,25.6700000,,1.0269531,0.0000000,NO,,0.9136338
TLGLIPKPPSFSEDDSESENCEK,ph,S,365,true,"atm-3 X-ray callus - FC atm vs. atm Xray",111d,31410901,,25.6700000,,1.0269531,0.0000000,NO,,0.9136338
TLGLIPKPPSFSEDDSESENCEK,ph,S,365,true,"Tissue atlas Arabidopsis - ProteomicsDB",114,32188942,"MaxQuant score",192.5500000,0.9733600,,,,0,
