Peptide,PTM,ModifiedAA,ModifiedPosition,PeptideUniqueToGene,ExperimentDesc,ExpID,PubmedID,ScoreType,IdentScore,LocProb,Log2FChange,PQ-val,QuantSig,PEP,MassErrorPPM
MKKVFGQTVR,nta,M,1,true,"Arg/N-end rule pathway Roots",80,25728785,"MASCOT Score",34.9100000,,,,,0.1368999928236,
MKKVFGQTVR,nta,M,1,true,"Arabidopsis translation initiation landscape - NTA",167a,35069635,,,,,,,,
KVFGQTVR,ph,T,8,true,"Tissue atlas Arabidopsis - ProteomicsDB",114,32188942,"MaxQuant score",110.4600000,1.0000000,,,,0.0087023600935936,
QKAAANR,me1,K,152,true,"Arabidopsis protein methylome",123,31809900,"MaxQuant Score",140.1200000,1.0000000,,,,2.5627398822792E-25,-0.0187540
YRSSAPGGMYKPSGGYGDK,ph,S,163,true,"Phospho cell culture sucrose/TOR",109,30833711,,,0.7866150,,,,,
DEERSSYGR,ph,S,190,true,"atm and atr DNA damage response",88,25561503,"MASCOT Score",27.0000000,0.9470000,,,,,-0.0800000
EYGYRDDDRNSR,ph,S,206,false,"Tissue atlas Arabidopsis - ProteomicsDB",114,32188942,"MaxQuant score",106.4200000,1.0000000,,,,2.7820200557471E-5,
HSRDSEDRYGR,ph,S,216,true,"Tissue atlas Arabidopsis - ProteomicsDB",114,32188942,"MaxQuant score",79.8850000,0.8928070,,,,0.00044381900806911,
SRSVDNYGSR,ph,S,234,true,"atm and atr DNA damage response",88,25561503,"MASCOT Score",22.0000000,1.0000000,,,,,0.1100000
SRSVDNYGSR,ph,S,234,true,"Phospho cell culture sucrose/TOR",109,30833711,,,0.9029680,,,,,
SVDNYGSR,nt,S,236,true,"Metacaspase9 substrates - 35S:MC9 / mc9",51b,23964026,"MASCOT Score",49.0000000,,1.5024804,,NO,,0.0000000
SRSVDNYGSR,ph,S,236,true,"STN8 phosphoproteome",38,21768351,"MASCOT Score",44.5400000,,,,,,-0.5447200
SRSVDNYGSR,ph,S,236,true,"LAXIC - mannitol vs control",84b,23660473,XCorr,2.3800000,0.9940000,,,,0.004880310036242,
SRSVDNYGSR,ph,S,236,true,"SnRK2 protein kinase substrates",85,23776212,XCorr,3.0461922,0.9990000,,,,0.00052925100317225,
SRSVDNYGSR,ph,S,236,true,"atm and atr DNA damage response",88,25561503,"MASCOT Score",55.0000000,1.0000000,,,,,-0.0600000
SRSVDNYGSR,ph,S,236,true,"TOR Kinase and ABA Receptor",100,29290610,XCorr,3.5615468,0.8938000,,,,0.0039550000801682,
SVDNYGSR,ph,S,236,true,"atm and atr DNA damage response",88,25561503,"MASCOT Score",37.0000000,1.0000000,,,,,-0.4200000
SVDNYGSR,ph,S,236,true,"Protein sumoylation and phosphorylation cross-talk",97,28419593,,,,,,,,
SVDNYGSR,ph,S,236,true,"Phospho cell culture sucrose/TOR",109,30833711,,,0.9998490,,,,,
SVDNYGSR,ph,S,236,true,"Col-0 callus - FC Col-0 vs. Col-0 Xray",111a,31410901,,38.5400000,,-0.1239297,0.0000000,NO,,1.4632031
SVDNYGSR,ph,S,236,true,"Col-0 X-ray callus - FC Col-0 vs. Col-0 Xray",111b,31410901,,38.5400000,,-0.1239297,0.0000000,NO,,1.4632031
SVDNYGSR,ph,S,236,true,"atm callus - FC atm vs. atm Xray",111c,31410901,,38.5400000,,-1.3584604,0.0000000,NO,,1.4632031
SVDNYGSR,ph,S,236,true,"atm-3 X-ray callus - FC atm vs. atm Xray",111d,31410901,,38.5400000,,-1.3584604,0.0000000,NO,,1.4632031
SVDNYGSR,ph,S,236,true,"Tissue atlas Arabidopsis - ProteomicsDB",114,32188942,"MaxQuant score",171.3600000,1.0000000,,,,2.8017998943142E-7,
SRSVDNYGSR,ph,S,242,true,"atm and atr DNA damage response",88,25561503,"MASCOT Score",26.0000000,1.0000000,,,,,-0.7200000
SVDNYGSR,ph,S,242,true,"atm and atr DNA damage response",88,25561503,"MASCOT Score",42.0000000,0.9410000,,,,,0.1400000
SVDNYGSR,ph,S,242,true,"Tissue atlas Arabidopsis - ProteomicsDB",114,32188942,"MaxQuant score",86.3440000,0.9999770,,,,0.0030504800379276,
EREDDGHSSSRGSGAR,ph,S,258,true,"atm and atr DNA damage response",88,25561503,"MASCOT Score",20.0000000,0.9880000,,,,,0.0900000
EREDDGHSSSRGSGAR,ph,S,259,true,"atm and atr DNA damage response",88,25561503,"MASCOT Score",20.0000000,1.0000000,,,,,0.0900000
EREDDGHSSSRGSGAR,ph,S,262,true,"atm and atr DNA damage response",88,25561503,"MASCOT Score",20.0000000,1.0000000,,,,,0.0900000
ADDNSQDGRGGLQR,ph,S,270,true,"STN8 phosphoproteome",38,21768351,"MASCOT Score",55.1600000,,,,,,-3.0576100
ADDNSQDGRGGLQR,ph,S,270,true,"Chloroplast kinase substrates",60,19376835,"MASCOT Score",51.2500000,,,,,,-3.0576100
ADDNSQDGRGGLQR,ph,S,270,true,"TOR Kinase and ABA Receptor",100,29290610,XCorr,2.5443411,1.0000000,,,,0.0004567000141833,
ADDNSQDGRGGLQR,ph,S,270,true,"Tissue atlas Arabidopsis - ProteomicsDB",114,32188942,"MaxQuant score",89.3110000,1.0000000,,,,6.6013497416861E-5,
KFSEQNIGAPPSYEEAVSDSRSPVYSER,ph,S,282,true,"STN8 phosphoproteome",38,21768351,"MASCOT Score",111.1300000,,,,,,-0.8245210
KFSEQNIGAPPSYEEAVSDSRSPVYSER,ph,S,282,true,"Large-scale phosphorylation discovery",44,23111157,XCorr,4.7360000,,,,,,
KFSEQNIGAPPSYEEAVSDSRSPVYSER,ph,S,282,true,"PAMP-triggered phosphorylation",48,24601666,"MASCOT Score",52.2600000,,,,,,
KFSEQNIGAPPSYEEAVSDSRSPVYSER,ph,S,282,true,"Chloroplast kinase substrates",60,19376835,"MASCOT Score",128.7600000,,,,,,-0.8245210
KFSEQNIGAPPSYEEAVSDSRSPVYSER,ph,S,282,true,"srk2dei ABA signaling phopshoproteomics",83,23572148,"MASCOT Score",92.0000000,,,,,,-0.0009000
KFSEQNIGAPPSYEEAVSDSRSPVYSER,ph,S,282,true,"LAXIC - mannitol vs control",84b,23660473,XCorr,6.4300000,0.9740000,,,,1.1000000216255E-10,
KFSEQNIGAPPSYEEAVSDSRSPVYSER,ph,S,282,true,"SnRK2 protein kinase substrates",85,23776212,XCorr,6.2886977,0.7810000,,,,5.1800902456378E-10,
KFSEQNIGAPPSYEEAVSDSRSPVYSER,ph,S,282,true,"TOR Kinase and ABA Receptor",100,29290610,XCorr,3.8705130,0.9712000,,,,0.085040003061295,
KFSEQNIGAPPSYEEAVSDSRSPVYSER,ph,S,282,true,"Phospho cell culture sucrose/TOR",109,30833711,,,1.0000000,,,,,
KFSEQNIGAPPSYEEAVSDSRSPVYSER,ph,S,282,true,"Tissue atlas Arabidopsis - ProteomicsDB",114,32188942,"MaxQuant score",312.6200000,1.0000000,,,,0,
KFSEQNIGAPPSYEEAVSDSR,ph,S,282,true,"Phosphorylation Early Elicitor Signaling",23,17317660,,,,,,,,
KFSEQNIGAPPSYEEAVSDSR,ph,S,282,true,"Phosphorylation nuclei-enriched fractions",28,19245862,,,,,,,,
KFSEQNIGAPPSYEEAVSDSR,ph,S,282,true,"Mitochondrial phosphoproteome",32,19688752,"MASCOT Score",50.6800000,,,,,,11.6512000
KFSEQNIGAPPSYEEAVSDSR,ph,S,282,true,"STN8 phosphoproteome",38,21768351,"MASCOT Score",115.5700000,,,,,,-1.6280500
KFSEQNIGAPPSYEEAVSDSR,ph,S,282,true,"Phosphoproteome iron-deficient Arabidopsis roots",41,22438062,"MASCOT Score",70.9800000,,,,,,
KFSEQNIGAPPSYEEAVSDSR,ph,S,282,true,"Pollen phosphoproteome Arabidopsis",43,22631563,"MASCOT Score",63.1400000,,,,,,-2.3643000
KFSEQNIGAPPSYEEAVSDSR,ph,S,282,true,"Phosphoproteome ethylene-regulated time response",46,24043427,"MASCOT Score",63.6100000,,,,,,6.2161000
KFSEQNIGAPPSYEEAVSDSR,ph,S,282,true,"PAMP-triggered phosphorylation",48,24601666,"MASCOT Score",75.4900000,,,,,,
KFSEQNIGAPPSYEEAVSDSR,ph,S,282,true,"Tyrosine phosphorylation in Arabidopsis",59,18463617,"MASCOT Score",50.0000000,,,,,,-0.8368058
KFSEQNIGAPPSYEEAVSDSR,ph,S,282,true,"Chloroplast kinase substrates",60,19376835,"MASCOT Score",123.7100000,,,,,,-1.5444400
KFSEQNIGAPPSYEEAVSDSR,ph,S,282,true,"srk2dei ABA signaling phopshoproteomics",83,23572148,"MASCOT Score",99.0000000,,,,,,-0.0020000
KFSEQNIGAPPSYEEAVSDSR,ph,S,282,true,"LAXIC - ABA stress",84a,23660473,XCorr,4.8300000,1.0000000,,,,8.590000238895E-11,
KFSEQNIGAPPSYEEAVSDSR,ph,S,282,true,"LAXIC - mannitol vs control",84b,23660473,XCorr,4.7600000,1.0000000,,,,5.8899997704324E-16,
KFSEQNIGAPPSYEEAVSDSR,ph,S,282,true,"SnRK2 protein kinase substrates",85,23776212,XCorr,4.7614770,1.0000000,,,,5.2160202155746E-13,
KFSEQNIGAPPSYEEAVSDSR,ph,S,282,true,"TOR Kinase and ABA Receptor",100,29290610,XCorr,4.3811793,1.0000000,,,,8.714000045984E-7,
KFSEQNIGAPPSYEEAVSDSR,ph,S,282,true,"Col-0 callus - FC Col-0 vs. Col-0 Xray",111a,31410901,,106.3600000,,0.9836079,0.0480336,YES,,1.0497451
KFSEQNIGAPPSYEEAVSDSR,ph,S,282,true,"Col-0 X-ray callus - FC Col-0 vs. Col-0 Xray",111b,31410901,,106.3600000,,0.9836079,0.0480336,YES,,1.0497451
KFSEQNIGAPPSYEEAVSDSR,ph,S,282,true,"atm callus - FC atm vs. atm Xray",111c,31410901,,106.3600000,,1.4839207,0.0082157,YES,,1.0497451
KFSEQNIGAPPSYEEAVSDSR,ph,S,282,true,"atm-3 X-ray callus - FC atm vs. atm Xray",111d,31410901,,106.3600000,,1.4839207,0.0082157,YES,,1.0497451
KFSEQNIGAPPSYEEAVSDSR,ph,S,282,true,"Touch-induced phosphorylation: 40s touch vs untouc",136,30291188,"MASCOT score",132.9900000,,0.4183156,0.0055519,YES,,1.3688544
FSEQNIGAPPSYEEAVSDSR,ph,S,282,true,"Arabidopsis root NAA phosphoproteome",18a,27643528,"MaxQuant Score",80.7860000,1.0000000,,,,3.0879999002309E-8,-0.6090000
FSEQNIGAPPSYEEAVSDSR,ph,S,282,true,"TOR Kinase and ABA Receptor",100,29290610,XCorr,4.0024595,1.0000000,,,,7.3579997206252E-7,
KFSEQNIGAPPSYEEAVSDSR,ph,S,291,true,"Tissue atlas Arabidopsis - ProteomicsDB",114,32188942,"MaxQuant score",88.0270000,0.8741730,,,,8.5182302445014E-16,
KFSEQNIGAPPSYEEAVSDSRSPVYSER,ph,Y,292,true,"PAMP-triggered phosphorylation",48,24601666,"MASCOT Score",40.1500000,,,,,,
KFSEQNIGAPPSYEEAVSDSRSPVYSER,ph,S,299,true,"PAMP-triggered phosphorylation",48,24601666,"MASCOT Score",50.7500000,,,,,,
KFSEQNIGAPPSYEEAVSDSRSPVYSER,ph,S,299,true,"Tissue atlas Arabidopsis - ProteomicsDB",114,32188942,"MaxQuant score",307.8900000,0.9240680,,,,0,
KFSEQNIGAPPSYEEAVSDSRSPVYSER,ph,S,301,true,"Large-scale phosphorylation discovery",44,23111157,XCorr,3.8730000,,,,,,
KFSEQNIGAPPSYEEAVSDSRSPVYSER,ph,S,301,true,"PAMP-triggered phosphorylation",48,24601666,"MASCOT Score",52.2600000,,,,,,
KFSEQNIGAPPSYEEAVSDSRSPVYSER,ph,S,301,true,"srk2dei ABA signaling phopshoproteomics",83,23572148,"MASCOT Score",92.0000000,,,,,,-0.0009000
FSEQNIGAPPSYEEAVSDSRSPVYSER,ph,S,301,true,"Col-0 callus - FC Col-0 vs. Col-0 Xray",111a,31410901,,20.7200000,,1.5543148,0.0164790,YES,,0.7059439
FSEQNIGAPPSYEEAVSDSRSPVYSER,ph,S,301,true,"Col-0 X-ray callus - FC Col-0 vs. Col-0 Xray",111b,31410901,,20.7200000,,1.5543148,0.0164790,YES,,0.7059439
FSEQNIGAPPSYEEAVSDSRSPVYSER,ph,S,301,true,"atm callus - FC atm vs. atm Xray",111c,31410901,,20.7200000,,0.8691946,0.0397838,YES,,0.7059439
FSEQNIGAPPSYEEAVSDSRSPVYSER,ph,S,301,true,"atm-3 X-ray callus - FC atm vs. atm Xray",111d,31410901,,20.7200000,,0.8691946,0.0397838,YES,,0.7059439
SPVYSER,ph,S,301,false,"Phospho cell culture sucrose/TOR",109,30833711,,,0.9999970,,,,,
SPVYSER,ph,S,301,false,"Tissue atlas Arabidopsis - ProteomicsDB",114,32188942,"MaxQuant score",247.0900000,1.0000000,,,,0,
KFSEQNIGAPPSYEEAVSDSRSPVYSER,ph,Y,304,true,"PAMP-triggered phosphorylation",48,24601666,"MASCOT Score",40.1500000,,,,,,
KFSEQNIGAPPSYEEAVSDSRSPVYSER,ph,Y,304,true,"srk2dei ABA signaling phopshoproteomics",83,23572148,"MASCOT Score",85.0000000,,,,,,-0.0008000
KFSEQNIGAPPSYEEAVSDSRSPVYSER,ph,Y,304,true,"SnRK2 protein kinase substrates",85,23776212,XCorr,5.0334268,0.7860000,,,,1.3614000063996E-13,
FSEQNIGAPPSYEEAVSDSRSPVYSER,ph,Y,304,true,"TOR Kinase and ABA Receptor",100,29290610,XCorr,4.2818084,0.7830000,,,,0.0072470000013709,
KFSEQNIGAPPSYEEAVSDSRSPVYSER,ph,S,305,true,"Large-scale phosphorylation discovery",44,23111157,XCorr,4.5290000,,,,,,
FSEQNIGAPPSYEEAVSDSRSPVYSER,ph,S,305,true,"Phospho cell culture sucrose/TOR",109,30833711,,,0.9976100,,,,,
SPVYSER,ph,S,305,false,"Tissue atlas Arabidopsis - ProteomicsDB",114,32188942,"MaxQuant score",100.7300000,0.9999510,,,,8.3007301839367E-23,
STPSGPAGQF,nt,S,633,true,"N-terminal ChaFRADIC",92,26010716,"MASCOT Score",27.9800000,,,,,0.017330000177026,
SSVWADTLSR,og,S,715,true,"O-GlcNac Inflorescence Tissue",81,28154133,"MASCOT Score",27.8000000,,,,,,2.0000000
GLVNFNISGSK,ph,S,734,true,"Tissue atlas Arabidopsis - ProteomicsDB",114,32188942,"MaxQuant score",102.6200000,0.8183030,,,,7.3084796895273E-5,
QTNTPATSTINMGK,ph,T,762,true,"Tissue atlas Arabidopsis - ProteomicsDB",114,32188942,"MaxQuant score",119.7700000,0.9999140,,,,0.00010512500011828,
AMGSGTGLGR,ph,S,776,false,"Tissue atlas Arabidopsis - ProteomicsDB",114,32188942,"MaxQuant score",57.8850000,0.9413720,,,,0.017697099596262,
