Peptide,PTM,ModifiedAA,ModifiedPosition,PeptideUniqueToGene,ExperimentDesc,ExpID,PubmedID,ScoreType,IdentScore,LocProb,Log2FChange,PQ-val,QuantSig,PEP,MassErrorPPM
MSDDDERGEEYLFK,ph,S,2,true,"Tyrosine phosphorylation in Arabidopsis",59,18463617,"MASCOT Score",30.0000000,,,,,,-0.7171662
MSDDDERGEEYLFK,ph,S,2,true,"atm and atr DNA damage response",88,25561503,"MASCOT Score",24.0000000,1.0000000,,,,,-0.6700000
SDDDERGEEYLFK,ph,S,2,true,"Tyrosine phosphorylation in Arabidopsis",59,18463617,"MASCOT Score",34.0000000,,,,,,-1.1893089
SDDDERGEEYLFK,ph,S,2,true,"BSK8 and BSL2 regulating sucrose-ph synthase",66,24924143,"MaxQuant Score",167.6100000,,,,,,0.4129000
SDDDERGEEYLFK,ph,S,2,true,"SIRK1 phosphorylation",86a,23820729,"MaxQuant Score",213.8800000,1.0000000,,,,3.5399998904451E-11,-0.8450000
SDDDERGEEYLFK,ph,S,2,true,"SIRK1 exp - sirk1 mutant vs WT",86b,23820729,,,,-1.1148749,,NO,,
SDDDERGEEYLFK,ph,S,2,true,"SIRK1 exp - 35S:SIRK1 vs WT",86c,23820729,,,,-1.3705372,,NO,,
SDDDERGEEYLFK,ph,S,2,true,"atm and atr DNA damage response",88,25561503,"MASCOT Score",41.0000000,1.0000000,,,,,-0.0900000
SDDDERGEEYLFK,ph,S,2,true,"Phospho cell culture sucrose/TOR",109,30833711,,,1.0000000,,,,,
SDDDERGEEYLFK,ph,S,2,true,"Tissue atlas Arabidopsis - ProteomicsDB",114,32188942,"MaxQuant score",191.0100000,1.0000000,,,,6.5438200049824E-31,
CDLESIR,sno,C,127,false,"hot5-4 / wildtype, FAT-switch S-nitrosoproteome",169,37277371,,,,,,,,
KQLNSDSYKEELTVNR,ph,S,186,true,"Phosphoproteome iron-deficient Arabidopsis roots",41,22438062,"MASCOT Score",36.9500000,,,,,,
QLNSDSYKEELTVNR,ph,S,186,true,"Tyrosine phosphorylation in Arabidopsis",59,18463617,"MASCOT Score",32.0000000,,,,,,-0.8000685
QLNSDSYKEELTVNR,ph,S,186,true,"srk2dei ABA signaling phopshoproteomics",83,23572148,"MASCOT Score",38.0000000,,,,,,0.0022000
QLNSDSYKEELTVNR,ph,S,186,true,"atm and atr DNA damage response",88,25561503,"MASCOT Score",47.0000000,0.9480000,,,,,0.0200000
QLNSDSYKEELTVNR,ph,S,186,true,"TOR Kinase and ABA Receptor",100,29290610,XCorr,2.8403735,0.9777000,,,,0.00015419999544974,
QLNSDSYKEELTVNR,ph,S,186,true,"Phospho cell culture sucrose/TOR",109,30833711,,,0.9957070,,,,,
QLNSDSYKEELTVNR,ph,S,186,true,"Tissue atlas Arabidopsis - ProteomicsDB",114,32188942,"MaxQuant score",256.5300000,0.9999990,,,,0,
VSLVKNENEGTK,ac,K,200,true,"Quantitative Acetylproteomics",101,29440448,,,,,,,,
