Peptide,PTM,ModifiedAA,ModifiedPosition,PeptideUniqueToGene,ExperimentDesc,ExpID,PubmedID,ScoreType,IdentScore,LocProb,Log2FChange,PQ-val,QuantSig,PEP,MassErrorPPM
AASLQSANPT,nt,A,2,true,"N-term acetylation drought responses",5,26184543,,,,,,,,
AASLQSANPT,nta,A,2,true,"N-term acetylation drought responses",5,26184543,,,,,,,,
TLASPNKPSSFATFR,ph,S,18,true,"Tissue atlas Arabidopsis - ProteomicsDB",114,32188942,"MaxQuant score",65.4770000,0.9990950,,,,0.0017961600096896,
FNSTSVASNFKPLVSR,ph,S,37,true,"Tissue atlas Arabidopsis - ProteomicsDB",114,32188942,"MaxQuant score",174.6500000,0.9849930,,,,2.5375300744076E-19,
SAAEPQERKTFHGLCYVVGDN,nt,S,60,true,"HUNTER N-terminome: legumain, GluC and trypsin",119,31951383,"MaxQuant score",90.2200000,,,,,,
SAAEPQERKTFHGLCYVVG,nt,S,60,true,"Arabidopsis translation initiation landscape - NT",167b,35069635,,,,,,,,
SAAEPQER,nt,S,60,true,"N-terminal ChaFRADIC",92,26010716,"MASCOT Score",45.3400000,,,,,0.00041979999514297,
SAAEPQER,nt,S,60,true,"Arg/N-end rule seed, prt6 vs. Wt",99,29168982,"MASCOT Score",42.1300000,,0.0320176,0.8604775,NO,0.055410001426935,-0.3915384
AAEPQER,nt,A,61,true,"N-terminal ChaFRADIC",92,26010716,"MASCOT Score",32.3100000,,,,,0.011909999884665,
YVVGDNIDTDQIIPAE,nt,Y,75,true,"Arg/N-end rule seed, prt6 vs. Wt",99,29168982,"MASCOT Score",92.4900000,,-0.2082801,0.5593193,NO,6.1690000330294E-11,-3.1297887
ERFVQPGEMK,mox,M,127,true,"cat2 Methionine oxidation - 1h stress",62a,25693801,"MASCOT Score",57.0000000,,0.0868857,,NO,,
ERFVQPGEMK,mox,M,127,true,"cat2 Methionine oxidation - 3h stress",62b,25693801,"MASCOT Score",43.0000000,,0.0318888,,NO,,
YSIIIGGENFGCGSSR,ox,C,142,false,"SPEAR - 10 mM H2O2 / mock",138a,34619326,,,,2.4519566,0.0039781,YES,,
YSIIIGGENFGCGSSR,sno,C,142,false,"Site-specific nitrosomeproteomic id - gsnor1-3",90a,25699590,XCorr,2.9337235,,,,,9.8459995570011E-6,-6.0431201
YSIIIGGENFGCGSSR,sno,C,142,false,"Site-specific nitrosomeproteomic id - gsnor1-3",90b,25699590,XCorr,2.9600000,,,,,3.9449998439522E-5,-6.6200000
YSIIIGGENFGCGSSR,so,C,142,false,"S-sulfenylation site detection using YAP1C",110,32714340,,,,,,,,
YSIIIGGENFGCGSSREHAPVCLGAAGAK,ph,S,144,false,"Brassinosteroid-Regulated Phosphorylation Dynamics",94,26187819,"MaxQuant Score",59.0050000,0.7560000,,,,0.014999999664724,0.7320000
YSIIIGGENFGCGSSR,ph,S,144,false,"Phospho cell culture sucrose/TOR",109,30833711,,,0.7887910,,,,,
YSIIIGGENFGCGSSR,ph,S,144,false,"Tissue atlas Arabidopsis - ProteomicsDB",114,32188942,"MaxQuant score",99.3440000,0.8324990,,,,7.1529498200107E-6,
EHAPVCLGAAGAK,ox,C,152,false,"OxiTRAQ Arabidopsis - 5 mM H2O2 versus control",47,24376095,,,,0.8555671,0.0094010,YES,,
EHAPVCLGAAGAK,sno,C,152,false,"Site-specific nitrosomeproteomic id - gsnor1-3",90a,25699590,XCorr,2.7569702,,,,,0.00071260001277551,-6.8962811
EHAPVCLGAAGAK,sno,C,152,false,"Site-specific nitrosomeproteomic id - gsnor1-3",90b,25699590,XCorr,3.2027543,,,,,0.23019999265671,-7.1594131
EHAPVCLGAAGAK,sno,C,152,false,"hot5-4 / wildtype, FAT-switch S-nitrosoproteome",169,37277371,,,,0.1235036,0.0065603,NO,,
EHAPVCLGAAGAK,so,C,152,false,"Arabidopsis S-sulfenylation chemoproteomics",108,31578252,"pFind PSM Score",0.0002337,,1.2915700,,,,-0.0304553
EHAPVCLGAAGAK,so,C,152,false,"S-sulfenylation site detection using YAP1C",110,32714340,,,,,,,,
SVATGEVYPLDSEVR,nt,S,174,true,"Arg/N-end rule seed, prt6 vs. Wt",99,29168982,"MASCOT Score",62.3300000,,-0.7776598,0.1964874,NO,0.0026370000559837,-1.4025433
VCDECTTGDVATVELR,ox,C,190,true,"OxiTRAQ SA and flg22 responses - SA vs mock",91a,25720653,"MASCOT Score",90.1900000,,0.7398481,0.0340000,YES,,
VCDECTTGDVATVELR,ox,C,190,true,"OxiTRAQ SA and flg22 responses - flg22 vs mock",91b,25720653,"MASCOT Score",90.1900000,,0.3561438,0.0000000,NO,,
VCDECTTGDVATVELR,ox,C,190,true,"SPEAR - 10 mM H2O2 / mock",138a,34619326,,,,-0.3678053,0.0290580,YES,,
VCDECTTGDVATVELR,sno,C,190,true,"Site-specific nitrosomeproteomic id - gsnor1-3",90a,25699590,XCorr,3.9500000,,,,,0.0066940002143383,-6.0700000
VCDECTTGDVATVELR,sno,C,190,true,"Site-specific nitrosomeproteomic id - gsnor1-3",90b,25699590,XCorr,4.2800000,,,,,0.014019999653101,-5.7400000
DECTTGDVATVELR,nt,D,191,true,"Arg/N-end rule seed, prt6 vs. Wt",99,29168982,"MASCOT Score",38.2400000,,0.0710016,0.5760687,NO,0.061790000647306,0.9818950
TTGDVATVELR,nt,T,194,true,"Arg/N-end rule seed, prt6 vs. Wt",99,29168982,"MASCOT Score",24.9700000,,-0.6668843,0.0033748,NO,0.097520001232624,-1.0603918
KAGMIPSAAA,ub,K,242,true,"Arabidopsis ubiquitination COFRADIC",40,26744219,"MaxQuant Score",71.6140000,1.0000000,,,,0.0020000000949949,-0.3640000
