Peptide,PTM,ModifiedAA,ModifiedPosition,PeptideUniqueToGene,ExperimentDesc,ExpID,PubmedID,ScoreType,IdentScore,LocProb,Log2FChange,PQ-val,QuantSig,PEP,MassErrorPPM
VSSIIAVAEGK,ph,S,4,true,"Tissue atlas Arabidopsis - ProteomicsDB",114,32188942,"MaxQuant score",113.2400000,0.9970020,,,,3.1248800951289E-5,
KMELEPNKSLSADMPSLLSR,ph,S,21,true,"Tissue atlas Arabidopsis - ProteomicsDB",114,32188942,"MaxQuant score",70.7180000,0.9938160,,,,0.00013799099542666,
SLSADMPSLLSR,ph,S,23,true,"Tissue atlas Arabidopsis - ProteomicsDB",114,32188942,"MaxQuant score",155.9800000,0.9999920,,,,1.0676699524481E-9,
SSEAFNGGTGYR,ph,S,33,true,"Tissue atlas Arabidopsis - ProteomicsDB",114,32188942,"MaxQuant score",168.7600000,0.9206890,,,,1.2055399809929E-14,
SSSDLSMFSSSLPTLFHEK,ph,S,55,true,"TOR Kinase and ABA Receptor",100,29290610,XCorr,2.5537963,0.7695000,,,,3.6469999031397E-5,
SSSDLSMFSSSLPTLFHEK,ph,S,55,true,"Tissue atlas Arabidopsis - ProteomicsDB",114,32188942,"MaxQuant score",210.4300000,0.9312950,,,,0,
LNMTDSDSWLSFDESSPNLNK,ph,S,79,true,"Tissue atlas Arabidopsis - ProteomicsDB",114,32188942,"MaxQuant score",266.2800000,0.9905060,,,,0,
LVIGNSEK,ph,S,90,true,"Tissue atlas Arabidopsis - ProteomicsDB",114,32188942,"MaxQuant score",118.8100000,1.0000000,,,,0.0023412499576807,
TEVTNFYNQVGSHVANSPPGNWPIGSPVK,ph,S,390,true,"TOR Kinase and ABA Receptor",100,29290610,XCorr,6.3768868,0.9982000,,,,8.6540003394475E-6,
TEVTNFYNQVGSHVANSPPGNWPIGSPVK,ph,S,390,true,"Tissue atlas Arabidopsis - ProteomicsDB",114,32188942,"MaxQuant score",206.6400000,0.9942950,,,,0,
TEVTNFYNQVGSHVANSPPGNWPIGSPVK,ph,S,399,true,"TOR Kinase and ABA Receptor",100,29290610,XCorr,6.3768868,1.0000000,,,,8.6540003394475E-6,
TEVTNFYNQVGSHVANSPPGNWPIGSPVK,ph,S,399,true,"Tissue atlas Arabidopsis - ProteomicsDB",114,32188942,"MaxQuant score",339.2900000,0.9999260,,,,0,
GLMHNISYGQPHSLPEHITGGISNSMR,ph,S,476,true,"Tissue atlas Arabidopsis - ProteomicsDB",114,32188942,"MaxQuant score",203.5600000,0.9999970,,,,0,
FIAPHSSGFGTSSDHR,og,S,496,true,"O-GlcNac Inflorescence Tissue",81,28154133,"MASCOT Score",53.5000000,,,,,,-0.2800000
FIAPHSSGFGTSSDHR,ph,S,496,true,"Tissue atlas Arabidopsis - ProteomicsDB",114,32188942,"MaxQuant score",117.8400000,0.8721410,,,,4.0714098759054E-8,
FIAPHSSGFGTSSDHR,ph,S,497,true,"Tissue atlas Arabidopsis - ProteomicsDB",114,32188942,"MaxQuant score",81.8780000,0.7763070,,,,7.6017502578907E-5,
FIAPHSSGFGTSSDHR,ph,S,502,true,"Tissue atlas Arabidopsis - ProteomicsDB",114,32188942,"MaxQuant score",129.3200000,0.7560310,,,,2.4050699209965E-8,
WGSPPQHMNYPGYTGVSSSSSSTERPFTVR,ph,S,511,true,"Large-scale phosphorylation discovery",44,23111157,XCorr,3.8490000,,,,,,
WGSPPQHMNYPGYTGVSSSSSSTERPFTVR,ph,S,511,true,"TOR Kinase and ABA Receptor",100,29290610,XCorr,3.0640056,0.9820000,,,,0.066770002245903,
WGSPPQHMNYPGYTGVSSSSSSTERPFTVR,ph,S,511,true,"Phospho cell culture sucrose/TOR",109,30833711,,,0.9969380,,,,,
WGSPPQHMNYPGYTGVSSSSSSTERPFTVR,ph,S,511,true,"Tissue atlas Arabidopsis - ProteomicsDB",114,32188942,"MaxQuant score",164.1100000,1.0000000,,,,0,
YQHHVGSAPSSIHFNTQMNCYTGSPEIPLGFSDMGINR,ph,S,560,true,"Tissue atlas Arabidopsis - ProteomicsDB",114,32188942,"MaxQuant score",168.1200000,0.9369710,,,,0,
