Peptide,PTM,ModifiedAA,ModifiedPosition,PeptideUniqueToGene,ExperimentDesc,ExpID,PubmedID,ScoreType,IdentScore,LocProb,Log2FChange,PQ-val,QuantSig,PEP,MassErrorPPM
LDFGSAPNPSCK,sno,C,98,true,"hot5-4 / wildtype, FAT-switch S-nitrosoproteome",169,37277371,,,,,,,,
LIPNSSLQQLSLR,ng,N,139,true,"Conserved N-glycosylation",74,22633491,"MaxQuant Score",114.1800000,1.0000000,,,,1.2310000130356E-8,3.0540000
LIPNSSLQQLSLR,ng,N,139,true,"N-linked Glycan Micro-heterogeneity Arabidopsis",134,29237727,,,,,,,,
LIPNSSLQQLSLR,ng,N,139,true,"UDP-GlcNAc transporter glycopeptide analysis",135,30224661,,,,,,,3.0176590393172E-11,1.0000000
LTNLSSLSLANNR,ng,N,334,true,"Conserved N-glycosylation",74,22633491,"MaxQuant Score",203.9800000,1.0000000,,,,1.9210000386293E-31,-0.7250000
LTNLSSLSLANNR,ng,N,334,true,"ER-associatied N-glycan degradation chilling stres",133,27558752,,,,,,,,
LTNLSSLSLANNR,ng,N,334,true,"N-linked Glycan Micro-heterogeneity Arabidopsis",134,29237727,,,,,,,,
LTNLSSLSLANNR,ng,N,334,true,"UDP-GlcNAc transporter glycopeptide analysis",135,30224661,,,,,,,2.4897438297409E-17,0.4000000
LTGEIPSGFESLPHVFHLNLSR,ng,N,363,true,"Conserved N-glycosylation",74,22633491,"MaxQuant Score",154.7500000,1.0000000,,,,1.4090000006847E-37,-0.6450000
GLCLNPEDEFSVVK,sno,C,396,true,"hot5-4 / wildtype, FAT-switch S-nitrosoproteome",169,37277371,,,,,,,,
TGVDVCGK,sno,C,413,true,"hot5-4 / wildtype, FAT-switch S-nitrosoproteome",169,37277371,,,,,,,,
NVSSGGGLSVHSSK,ng,N,416,true,"UDP-GlcNAc transporter glycopeptide analysis",135,30224661,,,,,,,3.3579265670131E-12,0.7000000
