Peptide,PTM,ModifiedAA,ModifiedPosition,PeptideUniqueToGene,ExperimentDesc,ExpID,PubmedID,ScoreType,IdentScore,LocProb,Log2FChange,PQ-val,QuantSig,PEP,MassErrorPPM
SADTSVAPLGSLKGTLTIVDER,nt,S,34,true,"Arg/N-end rule pathway Roots",80,25728785,"MASCOT Score",31.3800000,,,,,8.3530003394117E-6,
SADTSVAPLGSLKGTLTIVDER,nt,S,34,true,"N-terminal ChaFRADIC",92,26010716,"MASCOT Score",29.0600000,,,,,6.8960002153062E-9,
SADTSVAPLGSLKGTLTIVDER,nt,S,34,true,"Arg/N-end rule seed, prt6 vs. Wt",99,29168982,"MASCOT Score",23.4100000,,0.5723878,0.0224057,NO,0.00015110000094865,-2.7802823
SADTSVAPLGSLKGTLTIVDER,nt,S,34,true,"HUNTER N-terminome: legumain, GluC and trypsin",119,31951383,"MaxQuant score",106.0300000,,,,,,
SADTSVAPLGSLKGTLTIVDER,nt,S,34,true,"Arabidopsis translation initiation landscape - NT",167b,35069635,,,,,,,,
SADTSVAPLGSLKGTLTIVDE,nt,S,34,true,"N-terminal ChaFRADIC",92,26010716,"MASCOT Score",21.0500000,,,,,3.2319999831998E-7,
SADTSVAPLGSLKGTLTIVD,nt,S,34,true,"HUNTER N-terminome: legumain, GluC and trypsin",119,31951383,"MaxQuant score",124.8600000,,,,,,
GLKLYDPGYLNTAPVR,nt,G,86,false,"Metacaspase9 substrates - Col-0 / mc9",51a,23964026,"MASCOT Score",44.0000000,,,,,,-4.3137591
SSISYIDGDEGILR,nt,S,102,false,"Arabidopsis translation initiation landscape - NT",167b,35069635,,,,,,,,
YIDGDEGILR,nt,Y,106,false,"Arg/N-end rule seed, prt6 vs. Wt",99,29168982,"MASCOT Score",45.2600000,,-0.6214455,0.0003451,NO,0.010499999858439,-1.5920167
GQDIYDSKQVR,ub,K,209,true,"Arabidopsis ubiquitination COFRADIC",40,26744219,"MaxQuant Score",113.9300000,1.0000000,,,,3.8070000485391E-9,-0.7840000
AEHEMNCSTAAAR,nt,A,282,false,"Arg/N-end rule seed, prt6 vs. Wt",99,29168982,"MASCOT Score",40.8400000,,,,,0.027629999443889,-0.6700421
AALSDDYFVKR,ac,K,406,true,"Histone deacetylases substrates - hda14 vs WT",98e,29061669,"MaxQuant Score",52.2000000,1.0000000,-0.1160000,0.9099133,NO,0.016000000759959,
AALSDDYFVKR,ac,K,406,true,"Quantitative Acetylproteomics",101,29440448,,,,,,,,
HYTPVRER,ph,T,474,true,"TOR Kinase and ABA Receptor",100,29290610,XCorr,2.2146339,0.9506000,,,,0.0010079999919981,
