Peptide,PTM,ModifiedAA,ModifiedPosition,PeptideUniqueToGene,ExperimentDesc,ExpID,PubmedID,ScoreType,IdentScore,LocProb,Log2FChange,PQ-val,QuantSig,PEP,MassErrorPPM
AARNLEKMASIDAQL,nta,A,2,false,"Arabidopsis translation initiation landscape - NTA",167a,35069635,,,,,,,,
MASIDAQLR,ph,S,11,false,"Arabidopsis root NAA phosphoproteome",18a,27643528,"MaxQuant Score",74.9620000,1.0000000,,,,0.0003226000117138,-0.0970000
MASIDAQLR,ph,S,11,false,"Phosphorylation Early Elicitor Signaling",23,17317660,,,,,,,,
MASIDAQLR,ph,S,11,false,"Pollen phosphoproteome Arabidopsis",43,22631563,"MASCOT Score",84.3500000,,,,,,-1.0597800
MASIDAQLR,ph,S,11,false,"Phosphoproteome ethylene-regulated time response",46,24043427,"MASCOT Score",59.5000000,,,,,,14.5619000
MASIDAQLR,ph,S,11,false,"PAMP-triggered phosphorylation",48,24601666,"MASCOT Score",21.3200000,,,,,,
MASIDAQLR,ph,S,11,false,"Tyrosine phosphorylation in Arabidopsis",59,18463617,"MASCOT Score",72.0000000,,,,,,-1.1075454
MASIDAQLR,ph,S,11,false,"BSK8 and BSL2 regulating sucrose-ph synthase",66,24924143,"MaxQuant Score",145.0900000,,,,,,-0.1615000
MASIDAQLR,ph,S,11,false,"srk2dei ABA signaling phopshoproteomics",83,23572148,"MASCOT Score",78.0000000,,,,,,-0.0002000
MASIDAQLR,ph,S,11,false,"LAXIC - ABA stress",84a,23660473,XCorr,3.5200000,1.0000000,,,,9.5700001111254E-5,
MASIDAQLR,ph,S,11,false,"LAXIC - mannitol vs control",84b,23660473,XCorr,3.1500000,1.0000000,-1.2367594,,NO,0.00030260300263762,
MASIDAQLR,ph,S,11,false,"SnRK2 protein kinase substrates",85,23776212,XCorr,3.5979900,1.0000000,,,,0.0075616100803018,
MASIDAQLR,ph,S,11,false,"SIRK1 phosphorylation",86a,23820729,"MaxQuant Score",136.5300000,1.0000000,,,,0.0080000003799796,9.5290000
MASIDAQLR,ph,S,11,false,"SIRK1 exp - sirk1 mutant vs WT",86b,23820729,,,,-1.8530176,,NO,,
MASIDAQLR,ph,S,11,false,"SIRK1 exp - 35S:SIRK1 vs WT",86c,23820729,,,,-0.6208321,,NO,,
MASIDAQLR,ph,S,11,false,"atm and atr DNA damage response",88,25561503,"MASCOT Score",59.0000000,1.0000000,,,,,-0.1800000
MASIDAQLR,ph,S,11,false,"Brassinosteroid-Regulated Phosphorylation Dynamics",94,26187819,"MaxQuant Score",161.9400000,1.0000000,,,,4.651999965799E-11,1.9960000
MASIDAQLR,ph,S,11,false,"TOR Kinase and ABA Receptor",100,29290610,XCorr,3.3678575,1.0000000,,,,0.00015910000365693,
MASIDAQLR,ph,S,11,false,"Lateral root-induction - NAA vs control",106,23328941,"MASCOT Score",51.0000000,,-0.1542031,0.4204800,NO,,
MASIDAQLR,ph,S,11,false,"Phospho cell culture sucrose/TOR",109,30833711,,,1.0000000,,,,,
MASIDAQLR,ph,S,11,false,"Col-0 callus - FC Col-0 vs. Col-0 Xray",111a,31410901,,58.3400000,,-0.3840824,0.0000000,NO,,-0.0955665
MASIDAQLR,ph,S,11,false,"Col-0 X-ray callus - FC Col-0 vs. Col-0 Xray",111b,31410901,,58.3400000,,-0.3840824,0.0000000,NO,,-0.0955665
MASIDAQLR,ph,S,11,false,"atm callus - FC atm vs. atm Xray",111c,31410901,,58.3400000,,-0.2894670,0.0000000,NO,,-0.0955665
MASIDAQLR,ph,S,11,false,"atm-3 X-ray callus - FC atm vs. atm Xray",111d,31410901,,58.3400000,,-0.2894670,0.0000000,NO,,-0.0955665
MASIDAQLR,ph,S,11,false,"Tissue atlas Arabidopsis - ProteomicsDB",114,32188942,"MaxQuant score",166.6600000,1.0000000,,,,2.4119999579852E-5,
NLAEEVQIAYR,nt,N,106,false,"Arg/N-end rule seed, prt6 vs. Wt",99,29168982,"MASCOT Score",53.6600000,,-1.2919607,0.0109306,YES,0.0061019998975098,-1.1293147
SLLQKFGR,ac,K,184,true,"Histone deacetylases - apicidin vs control",98a,29061669,"MaxQuant Score",115.7000000,1.0000000,0.0570000,0.8035261,NO,0.0040000001899898,
SLLQKFGR,ac,K,184,true,"Histone deacetylases substrates - hda14 vs WT",98e,29061669,"MaxQuant Score",71.5000000,1.0000000,0.1140000,0.9120108,NO,0.0089999996125698,
SLLQKFGR,ac,K,184,true,"Quantitative Acetylproteomics",101,29440448,,,,,,,,
IRDCLTQLYAK,sno,C,191,true,"Site-specific nitrosomeproteomic id - gsnor1-3",90b,25699590,XCorr,2.1300000,,,,,0.025200000032783,-7.4000000
IRDCLTQLYAK,so,C,191,true,"Arabidopsis S-sulfenylation chemoproteomics",108,31578252,"pFind PSM Score",0.0113922,,1.0239100,,,,-1.7470063
DITPDDKQELDEALQR,ph,T,201,false,"TOR Kinase and ABA Receptor",100,29290610,XCorr,3.4347489,1.0000000,,,,0.00013420000323094,
DITPDDKQELDEALQR,ph,T,201,false,"Tissue atlas Arabidopsis - ProteomicsDB",114,32188942,"MaxQuant score",201.9500000,1.0000000,,,,0,
DITPDDKQELDEALQR,ac,K,205,false,"Quantitative Acetylproteomics",101,29440448,,,,,,,,
TPPTPQDEMR,ph,T,231,false,"Lateral root-induction - NAA vs control",106,23328941,"MASCOT Score",27.0000000,,,,,,
GVPKFLR,ac,K,253,false,"Quantitative Acetylproteomics",101,29440448,,,,,,,,
RVDTALK,ph,T,260,false,"TOR Kinase and ABA Receptor",100,29290610,XCorr,2.2512956,1.0000000,,,,0.0060769999399781,
RVDTALKNIGINER,ac,K,263,true,"Quantitative Acetylproteomics",101,29440448,,,,,,,,
VDTALKNIGINER,ac,K,263,true,"Quantitative Acetylproteomics",101,29440448,,,,,,,,
DVCLLAR,ox,C,303,false,"OxiTRAQ Arabidopsis - 5 mM H2O2 versus control",47,24376095,,,,-0.0436866,0.1872400,NO,,
DVCLLAR,sno,C,303,false,"hot5-4 / wildtype, FAT-switch S-nitrosoproteome",169,37277371,,,,,,,,
DAKHYIEFWK,ac,K,349,true,"Quantitative Acetylproteomics",101,29440448,,,,,,,,
SLCDCGDRPIADGSLLDFLR,sno,C,417,true,"Site-specific nitrosomeproteomic id - gsnor1-3",90a,25699590,XCorr,3.5806272,,,,,2.3500000168042E-7,-5.5667407
SLCDCGDRPIADGSLLDFLR,sno,C,417,true,"Site-specific nitrosomeproteomic id - gsnor1-3",90b,25699590,XCorr,3.9400000,,,,,0.0042630000971258,-3.9000000
ECGITDPLR,sno,C,546,true,"hot5-4 / wildtype, FAT-switch S-nitrosoproteome",169,37277371,,,,0.8202901,0.0000292,YES,,
INGKQEVMIGYSDSGK,ub,K,587,false,"upl3 mutant / wildtype",168,35926874,"MaxQuant score",102.2900000,1.0000000,-0.7883647,,,5.1780599363838E-8,-0.0181410
QEVMIGYSDSGK,ph,S,595,false,"Tissue atlas Arabidopsis - ProteomicsDB",114,32188942,"MaxQuant score",59.6630000,0.7614170,,,,0.0035977200604975,
VAKEYGVKLTMFHGR,ub,K,622,false,"Ubiquitination Membrane Proteins",120,33585938,,,,,,,,
VAKEYGVKLTMFHGR,ub,K,622,false,"upl3 mutant / wildtype",168,35926874,"MaxQuant score",85.4690000,1.0000000,-1.8109662,0.1721410,NO,4.6562799980165E-6,-0.7019500
VAKEYGVKLTMFHGR,ub,K,627,false,"Ubiquitination Membrane Proteins",120,33585938,,,,,,,,
VAKEYGVKLTMFHGR,ub,K,627,false,"upl3 mutant / wildtype",168,35926874,"MaxQuant score",85.4690000,1.0000000,-1.8109662,0.1721410,NO,4.6562799980165E-6,-0.7019500
EYGVKLTMFHGR,ub,K,627,false,"Ubiquitination Membrane Proteins",120,33585938,,,,,,,,
YGVKLTMFHGR,ub,K,627,false,"Ubiquitination Membrane Proteins",120,33585938,,,,,,,,
YGVKLTMFHGR,ub,K,627,false,"upl3 mutant / wildtype",168,35926874,"MaxQuant score",152.0400000,1.0000000,-0.2498223,0.6920400,NO,1.8653799338519E-10,-0.3110300
VTVQGEVIEQSFGEEHLCFR,so,C,680,false,"Arabidopsis S-sulfenylation chemoproteomics",108,31578252,"pFind PSM Score",0.0626414,,,,,,-0.9470740
FTAATLEHGMHPPVSPKPEWR,ph,S,701,true,"TOR Kinase and ABA Receptor",100,29290610,XCorr,3.7536359,1.0000000,,,,0.0001470999995945,
FTAATLEHGMHPPVSPKPEWR,ph,S,701,true,"Tissue atlas Arabidopsis - ProteomicsDB",114,32188942,"MaxQuant score",197.5400000,1.0000000,,,,0,
SVVFKEPR,nt,S,723,true,"N-terminal ChaFRADIC",92,26010716,"MASCOT Score",25.8900000,,,,,0.0012760000536218,
SVVFKEPR,ub,K,727,true,"upl3 mutant / wildtype",168,35926874,"MaxQuant score",47.5740000,1.0000000,,,,0.021694699302316,-1.4242000
MNIGSRPSKR,ac,K,755,false,"Quantitative Acetylproteomics",101,29440448,,,,,,,,
KPSGGIESLR,ub,K,757,false,"upl3 mutant / wildtype",168,35926874,"MaxQuant score",62.7050000,1.0000000,-0.0350469,,,0.002974659902975,-0.3716600
RKPSGGIESLR,ph,S,759,false,"srk2dei ABA signaling phopshoproteomics",83,23572148,"MASCOT Score",64.0000000,,,,,,0.0011000
RKPSGGIESLR,ph,S,759,false,"atm and atr DNA damage response",88,25561503,"MASCOT Score",26.0000000,1.0000000,,,,,0.4100000
RKPSGGIESLR,ph,S,759,false,"TOR Kinase and ABA Receptor",100,29290610,XCorr,3.2566388,0.9997000,,,,0.00052529998356476,
RKPSGGIESLR,ph,S,759,false,"Phospho cell culture sucrose/TOR",109,30833711,,,0.9992160,,,,,
RKPSGGIESLR,ph,S,759,false,"Tissue atlas Arabidopsis - ProteomicsDB",114,32188942,"MaxQuant score",79.7050000,0.9999900,,,,0.0020544300787151,
KPSGGIESLR,ph,S,759,false,"Phosphoproteome ethylene-regulated time response",46,24043427,"MASCOT Score",44.2800000,,,,,,-7.5482000
KPSGGIESLR,ph,S,759,false,"atm and atr DNA damage response",88,25561503,"MASCOT Score",40.0000000,1.0000000,,,,,-1.5200000
KPSGGIESLR,ph,S,759,false,"Lateral root-induction - NAA vs control",106,23328941,"MASCOT Score",40.0000000,,,,,,
KPSGGIESLR,ph,S,764,false,"atm and atr DNA damage response",88,25561503,"MASCOT Score",51.0000000,1.0000000,,,,,-1.5900000
DYMESSPAAELVK,ph,Y,922,true,"atm and atr DNA damage response",88,25561503,"MASCOT Score",38.0000000,1.0000000,,,,,-1.1900000
DYMESSPAAELVK,mox,M,923,true,"cat2 Methionine oxidation - 1h stress",62a,25693801,"MASCOT Score",52.0000000,,0.2223444,,NO,,
DYMESSPAAELVK,mox,M,923,true,"cat2 Methionine oxidation - 3h stress",62b,25693801,"MASCOT Score",28.0000000,,0.0515388,,NO,,
DYMESSPAAELVK,ph,S,926,true,"Large-scale phosphorylation discovery",44,23111157,XCorr,3.2760000,,,,,,
DYMESSPAAELVK,ph,S,926,true,"Tissue atlas Arabidopsis - ProteomicsDB",114,32188942,"MaxQuant score",186.1300000,0.9960110,,,,3.4673200953075E-22,
DYMESSPAAELVKLNPK,ub,K,933,true,"upl3 mutant / wildtype",168,35926874,"MaxQuant score",90.3480000,1.0000000,-0.2412704,0.6308000,NO,6.1134301176935E-7,-1.0102000
SEYAPGLEDTVILTMK,mox,M,952,true,"cat2 Methionine oxidation - 1h stress",62a,25693801,"MASCOT Score",65.0000000,,-0.3104203,,NO,,
SEYAPGLEDTVILTMK,mox,M,952,true,"cat2 Methionine oxidation - 3h stress",62b,25693801,"MASCOT Score",54.0000000,,-0.1550432,,NO,,
