Peptide,PTM,ModifiedAA,ModifiedPosition,PeptideUniqueToGene,ExperimentDesc,ExpID,PubmedID,ScoreType,IdentScore,LocProb,Log2FChange,PQ-val,QuantSig,PEP,MassErrorPPM
RLSLEPAIDSITGR,ph,S,8,true,"srk2dei ABA signaling phopshoproteomics",83,23572148,"MASCOT Score",47.0000000,,,,,,0.0010000
RLSLEPAIDSITGR,ph,S,8,true,"LAXIC - mannitol vs control",84b,23660473,XCorr,2.6800000,1.0000000,,,,0.014337699860334,
RLSLEPAIDSITGR,ph,S,8,true,"atm and atr DNA damage response",88,25561503,"MASCOT Score",34.0000000,1.0000000,,,,,-0.3200000
RLSLEPAIDSITGR,ph,S,8,true,"TOR Kinase and ABA Receptor",100,29290610,XCorr,4.1718111,1.0000000,,,,2.0400000721565E-5,
RLSLEPAIDSITGR,ph,S,8,true,"Phospho cell culture sucrose/TOR",109,30833711,,,0.9999990,,,,,
RLSLEPAIDSITGR,ph,S,8,true,"Col-0 callus - FC Col-0 vs. Col-0 Xray",111a,31410901,,61.8800000,,-0.0795856,0.0000000,NO,,0.2301678
RLSLEPAIDSITGR,ph,S,8,true,"Col-0 X-ray callus - FC Col-0 vs. Col-0 Xray",111b,31410901,,61.8800000,,-0.0795856,0.0000000,NO,,0.2301678
RLSLEPAIDSITGR,ph,S,8,true,"atm callus - FC atm vs. atm Xray",111c,31410901,,61.8800000,,0.6207578,0.0000000,NO,,0.2301678
RLSLEPAIDSITGR,ph,S,8,true,"atm-3 X-ray callus - FC atm vs. atm Xray",111d,31410901,,61.8800000,,0.6207578,0.0000000,NO,,0.2301678
RLSLEPAIDSITGR,ph,S,8,true,"Tissue atlas Arabidopsis - ProteomicsDB",114,32188942,"MaxQuant score",160.0900000,1.0000000,,,,1.048020004113E-10,
RLSLEPAIDSITGR,ph,S,8,true,"Touch-induced phosphorylation: 40s touch vs untouc",136,30291188,"MASCOT score",69.4100000,,-0.0791859,0.5572380,NO,,5.1122082
ELDLGSPVSTLMPR,ph,S,42,true,"Large-scale phosphorylation discovery",44,23111157,XCorr,3.9540000,,,,,,
ELDLGSPVSTLMPR,ph,S,42,true,"SnRK2 protein kinase substrates",85,23776212,XCorr,2.0237062,0.9990000,,,,0.00060866499552503,
ELDLGSPVSTLMPR,ph,S,42,true,"atm and atr DNA damage response",88,25561503,"MASCOT Score",79.0000000,1.0000000,,,,,-0.1200000
ELDLGSPVSTLMPR,ph,S,42,true,"TOR Kinase and ABA Receptor",100,29290610,XCorr,4.3592582,0.9987000,,,,0.00063520000549033,
ELDLGSPVSTLMPR,ph,S,42,true,"Phospho cell culture sucrose/TOR",109,30833711,,,0.9886160,,,,,
ELDLGSPVSTLMPR,ph,S,42,true,"Tissue atlas Arabidopsis - ProteomicsDB",114,32188942,"MaxQuant score",190.0600000,1.0000000,,,,6.9549498594791E-32,
SHSGELSSPGSGMPTTTR,ph,S,93,true,"Large-scale phosphorylation discovery",44,23111157,XCorr,4.5130000,,,,,,
SHSGELSSPGSGMPTTTR,ph,S,93,true,"atm and atr DNA damage response",88,25561503,"MASCOT Score",62.0000000,0.9940000,,,,,-1.0200000
SHSGELSSPGSGMPTTTR,ph,S,93,true,"TOR Kinase and ABA Receptor",100,29290610,XCorr,4.3765273,0.9079000,,,,1.0579999525362E-6,
SHSGELSSPGSGMPTTTR,ph,S,93,true,"Phospho cell culture sucrose/TOR",109,30833711,,,0.9813010,,,,,
SHSGELSSPGSGMPTTTR,ph,S,93,true,"Tissue atlas Arabidopsis - ProteomicsDB",114,32188942,"MaxQuant score",172.2400000,0.9981240,,,,1.0105200343804E-27,
SHSGELSSPGSGMPTTTR,ph,S,98,true,"atm and atr DNA damage response",88,25561503,"MASCOT Score",30.0000000,0.9940000,,,,,-0.3800000
SHSGELSSPGSGMPTTTR,ph,S,98,true,"Tissue atlas Arabidopsis - ProteomicsDB",114,32188942,"MaxQuant score",189.4100000,0.9861490,,,,3.3921099643336E-37,
TSSRTETLCTGTGNYGHGNVVR,ph,T,182,true,"atm and atr DNA damage response",88,25561503,"MASCOT Score",69.0000000,0.9480000,,,,,-0.1300000
AILISPGNAAYR,ph,S,250,true,"Tissue atlas Arabidopsis - ProteomicsDB",114,32188942,"MaxQuant score",82.3620000,0.9997690,,,,0.00092194700846449,
