Peptide,PTM,ModifiedAA,ModifiedPosition,PeptideUniqueToGene,ExperimentDesc,ExpID,PubmedID,ScoreType,IdentScore,LocProb,Log2FChange,PQ-val,QuantSig,PEP,MassErrorPPM
SASWADVADSENTGSGSSNQNSHPSR,nt,S,2,true,"Arg/N-end rule seed, prt6 vs. Wt",99,29168982,"MASCOT Score",46.1300000,,,,,0.0012009999481961,-1.9362256
SASWADVADSENTGSGSSNQNSHPSR,nt,S,2,true,"FtsH12 N-terminome: WT / FtsH12 knockdown miRNA",118,33216923,"MaxQuant score",69.3980000,,,,,9.7600002391118E-7,
SASWADVADSENTGSGSSNQNSHPSRPAYVPPHLR,nta,S,2,true,"HUNTER N-terminome: legumain, GluC and trypsin",119,31951383,"MaxQuant score",109.7700000,,,,,,
SASWADVADSENTGSGSSNQNSHPSR,nta,S,2,true,"Arg/N-end rule seed, prt6 vs. Wt",99,29168982,"MASCOT Score",46.1300000,,,,,0.0012009999481961,-1.9362256
SASWADVADSENTGSGSSNQNSHPSR,nta,S,2,true,"HUNTER N-terminome: legumain, GluC and trypsin",119,31951383,"MaxQuant score",108.9400000,,,,,,
SASWADVADSE,nta,S,2,false,"HUNTER N-terminome: legumain, GluC and trypsin",119,31951383,"MaxQuant score",232.9700000,,,,,,
SASWADVAD,nta,S,2,false,"HUNTER N-terminome: legumain, GluC and trypsin",119,31951383,"MaxQuant score",156.4000000,,,,,,
NRPAASEPVAPLPANDR,ph,S,42,true,"Tissue atlas Arabidopsis - ProteomicsDB",114,32188942,"MaxQuant score",82.8770000,1.0000000,,,,0.00015218299813569,
VGYGGPPSGSR,ph,S,61,true,"Tissue atlas Arabidopsis - ProteomicsDB",114,32188942,"MaxQuant score",102.9000000,0.8250130,,,,6.4844600274228E-5,
WAPGGSGVGVGGGGGYR,ph,S,70,true,"Tissue atlas Arabidopsis - ProteomicsDB",114,32188942,"MaxQuant score",138.0500000,1.0000000,,,,2.7976901351146E-10,
ADAGRPGSGSGYGGR,ph,S,89,true,"atm and atr DNA damage response",88,25561503,"MASCOT Score",38.0000000,0.9100000,,,,,-0.3400000
ADAGRPGSGSGYGGR,ph,S,89,true,"Tissue atlas Arabidopsis - ProteomicsDB",114,32188942,"MaxQuant score",111.9300000,0.9955080,,,,1.3795599898003E-6,
DLMACAQTGSGK,ox,C,202,false,"OxiTRAQ Arabidopsis - 5 mM H2O2 versus control",47,24376095,,,,0.0241092,0.4224060,NO,,
DLMACAQTGSGK,sno,C,202,false,"hot5-4 / wildtype, FAT-switch S-nitrosoproteome",169,37277371,,,,,,,,
DLMACAQTGSGK,so,C,202,false,"S-sulfenylation site detection using YAP1C",110,32714340,,,,,,,,
TAAFCFPIISGIMK,so,C,214,false,"S-sulfenylation site detection using YAP1C",110,32714340,,,,,,,,
VVVAYGGTPINQQLR,ph,T,275,true,"Tissue atlas Arabidopsis - ProteomicsDB",114,32188942,"MaxQuant score",253.1600000,1.0000000,,,,0,
DILVATPGR,nt,D,289,false,"Arg/N-end rule seed, prt6 vs. Wt",99,29168982,"MASCOT Score",36.7500000,,,,,0.05782999843359,-1.0854171
GVDILVATPGR,ph,T,294,false,"Tissue atlas Arabidopsis - ProteomicsDB",114,32188942,"MaxQuant score",99.9410000,1.0000000,,,,0.0002346499968553,
VEFVLDSDKR,ac,K,398,true,"Quantitative Acetylproteomics",101,29440448,,,,,,,,
YASRSSFGGGK,ph,S,555,true,"Tissue atlas Arabidopsis - ProteomicsDB",114,32188942,"MaxQuant score",56.6500000,0.9238910,,,,0.011911599896848,
YASRSSFGGGK,ph,S,556,true,"Tissue atlas Arabidopsis - ProteomicsDB",114,32188942,"MaxQuant score",56.6500000,0.8902720,,,,0.011911599896848,
FGGRDFR,me1,R,572,false,"Arabidopsis protein methylome",123,31809900,"MaxQuant Score",61.5610000,1.0000000,,,,0.0010917800245807,0.1983800
REGSFGSGR,ph,S,579,true,"atm and atr DNA damage response",88,25561503,"MASCOT Score",49.0000000,1.0000000,,,,,0.0700000
REGSFGSGR,ph,S,579,true,"Tissue atlas Arabidopsis - ProteomicsDB",114,32188942,"MaxQuant score",89.4300000,0.9999570,,,,0.0018800699617714,
EGSFGSGR,ph,S,579,true,"atm and atr DNA damage response",88,25561503,"MASCOT Score",45.0000000,0.9990000,,,,,-0.9400000
