Peptide,PTM,ModifiedAA,ModifiedPosition,PeptideUniqueToGene,ExperimentDesc,ExpID,PubmedID,ScoreType,IdentScore,LocProb,Log2FChange,PQ-val,QuantSig,PEP,MassErrorPPM
GANSIPTDATIDLDEQISQLMQCKPLSEQQVR,nt,G,2,true,"Arg/N-end rule pathway Roots",80,25728785,"MASCOT Score",60.6400000,,,,,6.151999798476E-8,
GANSIPTDATIDLDEQISQLMQCKPLSEQQVR,nt,G,2,true,"Stromal N-terminome",96,26371235,"MASCOT Score",85.2200000,,,,,,
GANSIPTDATIDLDEQISQLMQCKPL,nt,G,2,true,"Arabidopsis translation initiation landscape - NT",167b,35069635,,,,,,,,
QISQLMQCKPLSE,nt,Q,17,false,"HUNTER N-terminome: legumain, GluC and trypsin",119,31951383,"MaxQuant score",,,,,,,
GANSIPTDATIDLDEQISQLMQCKPLSEQQVR,so,C,24,true,"S-sulfenylation site detection using YAP1C",110,32714340,,,,,,,,
AKEILMDESNVQPVK,ub,K,40,false,"upl3 mutant / wildtype",168,35926874,"MaxQuant score",127.1800000,1.0000000,-0.7107557,0.4125000,NO,1.2101799562458E-8,-0.7292400
SPVTICGDIHGQFHDLAELFR,sno,C,59,false,"Site-specific nitrosomeproteomic id - gsnor1-3",90b,25699590,XCorr,3.6200000,,,,,8.9699997429804E-10,-5.2800000
SRQITQVYGFYDE,nt,S,124,false,"Arabidopsis translation initiation landscape - NT",167b,35069635,,,,,,,,
QITQVYGFYDECLR,nt,Q,126,false,"HUNTER N-terminome: legumain, GluC and trypsin",119,31951383,"MaxQuant score",124.8600000,,,,,,
QITQVYGFYDECLRK,so,C,137,false,"Arabidopsis S-sulfenylation chemoproteomics",108,31578252,"pFind PSM Score",0.0002612,,,,,,-1.1928776
GGLSPSIETLDNIR,nt,G,172,false,"FtsH12 N-terminome: WT / FtsH12 knockdown miRNA",118,33216923,"MaxQuant score",77.5620000,,-1.0132685,0.0155202,YES,0.025103999301791,
VQEVPHEGPMCDLLWSDPDDR,sno,C,200,false,"Site-specific nitrosomeproteomic id - gsnor1-3",90a,25699590,XCorr,3.2181559,,,,,0.18250000476837,-6.6154163
VQEVPHEGPMCDLLWSDPDDR,sno,C,200,false,"Site-specific nitrosomeproteomic id - gsnor1-3",90b,25699590,XCorr,3.4200000,,,,,0.082149997353554,-4.2100000
CGWGISPR,acy,C,211,false,"Arabidopsis S-acylation atlas - Meristem",163a,35681017,,,,,,,,
CGWGISPR,ox,C,211,false,"SPEAR - 10 mM H2O2 / mock",138a,34619326,,,,5.8023103,0.0221343,YES,,
CGWGISPR,so,C,211,false,"S-sulfenylation site detection using YAP1C",110,32714340,,,,,,,,
CGWGISPR,ph,S,216,false,"Tissue atlas Arabidopsis - ProteomicsDB",114,32188942,"MaxQuant score",130.9800000,1.0000000,,,,0.0029158100951463,
CGNMASILEVDDCRNHTFIQFEPAPR,acy,C,273,false,"Arabidopsis S-acylation atlas - Stem",163f,35681017,,,,,,,,
CGNMASILEVDDCRNHTFIQFEPAPR,acy,C,285,false,"Arabidopsis S-acylation atlas - Stem",163f,35681017,,,,,,,,
