Peptide,PTM,ModifiedAA,ModifiedPosition,PeptideUniqueToGene,ExperimentDesc,ExpID,PubmedID,ScoreType,IdentScore,LocProb,Log2FChange,PQ-val,QuantSig,PEP,MassErrorPPM
MDSNNHLYDPNPTGSGLLR,ph,S,15,true,"Tissue atlas Arabidopsis - ProteomicsDB",114,32188942,"MaxQuant score",101.6400000,0.8798000,,,,6.9172600092315E-8,
FRSAPSSVLAAFVDDDK,ph,S,22,true,"TOR Kinase and ABA Receptor",100,29290610,XCorr,5.5543742,0.9942000,,,,4.536000020039E-8,
SAPSSVLAAFVDDDKIGFDSDR,ph,S,26,true,"Col-0 callus - FC Col-0 vs. Col-0 Xray",111a,31410901,,95.1700000,,-0.1634282,0.0000000,NO,,-0.1176697
SAPSSVLAAFVDDDKIGFDSDR,ph,S,26,true,"Col-0 X-ray callus - FC Col-0 vs. Col-0 Xray",111b,31410901,,95.1700000,,-0.1634282,0.0000000,NO,,-0.1176697
SAPSSVLAAFVDDDKIGFDSDR,ph,S,26,true,"atm callus - FC atm vs. atm Xray",111c,31410901,,95.1700000,,-0.5238349,0.0000000,NO,,-0.1176697
SAPSSVLAAFVDDDKIGFDSDR,ph,S,26,true,"atm-3 X-ray callus - FC atm vs. atm Xray",111d,31410901,,95.1700000,,-0.5238349,0.0000000,NO,,-0.1176697
FVTSNGVNGDLGSPKFEDK,ph,S,60,true,"Tissue atlas Arabidopsis - ProteomicsDB",114,32188942,"MaxQuant score",276.7900000,1.0000000,,,,0,
FVTSNGVNGDLGSPK,ph,S,60,true,"STN8 phosphoproteome",38,21768351,"MASCOT Score",113.2000000,,,,,,-0.9501910
FVTSNGVNGDLGSPK,ph,S,60,true,"Chloroplast kinase substrates",60,19376835,"MASCOT Score",125.5700000,,,,,,-1.4970200
FVTSNGVNGDLGSPK,ph,S,60,true,"atm and atr DNA damage response",88,25561503,"MASCOT Score",61.0000000,1.0000000,,,,,-0.0300000
FVTSNGVNGDLGSPK,ph,S,60,true,"TOR Kinase and ABA Receptor",100,29290610,XCorr,3.5965309,1.0000000,,,,0.013600000180304,
FVTSNGVNGDLGSPK,ph,S,60,true,"Col-0 callus - FC Col-0 vs. Col-0 Xray",111a,31410901,,93.7100000,,-0.2863179,0.0000000,NO,,0.9253299
FVTSNGVNGDLGSPK,ph,S,60,true,"Col-0 X-ray callus - FC Col-0 vs. Col-0 Xray",111b,31410901,,93.7100000,,-0.2863179,0.0000000,NO,,0.9253299
FVTSNGVNGDLGSPK,ph,S,60,true,"atm callus - FC atm vs. atm Xray",111c,31410901,,93.7100000,,-2.2108751,0.0000000,NO,,0.9253299
FVTSNGVNGDLGSPK,ph,S,60,true,"atm-3 X-ray callus - FC atm vs. atm Xray",111d,31410901,,93.7100000,,-2.2108751,0.0000000,NO,,0.9253299
QSSSPAGMFTNLSDQNGYGSMR,ph,S,136,true,"Tissue atlas Arabidopsis - ProteomicsDB",114,32188942,"MaxQuant score",299.6900000,0.9954430,,,,0,
NLMNYEEDEESPSNSNGLR,ph,S,166,true,"Tissue atlas Arabidopsis - ProteomicsDB",114,32188942,"MaxQuant score",304.0900000,0.9990130,,,,0,
MQLLSHHLSLPK,ph,S,251,true,"atm and atr DNA damage response",88,25561503,"MASCOT Score",63.0000000,1.0000000,,,,,-0.2300000
MQLLSHHLSLPK,ph,S,251,true,"TOR Kinase and ABA Receptor",100,29290610,XCorr,3.7551761,0.9990000,,,,0.0013999999500811,
MQLLSHHLSLPK,ph,S,251,true,"Phospho cell culture sucrose/TOR",109,30833711,,,0.9982860,,,,,
MQLLSHHLSLPK,ph,S,251,true,"Tissue atlas Arabidopsis - ProteomicsDB",114,32188942,"MaxQuant score",128.6400000,0.9999700,,,,9.0188796093571E-6,
SSSTASDMVSVDK,ph,S,257,true,"Tissue atlas Arabidopsis - ProteomicsDB",114,32188942,"MaxQuant score",124.4200000,0.9954040,,,,1.9537899788702E-5,
GCATHPR,sno,C,285,false,"hot5-4 / wildtype, FAT-switch S-nitrosoproteome",169,37277371,,,,-0.4198740,0.1105056,NO,,
