Peptide,PTM,ModifiedAA,ModifiedPosition,PeptideUniqueToGene,ExperimentDesc,ExpID,PubmedID,ScoreType,IdentScore,LocProb,Log2FChange,PQ-val,QuantSig,PEP,MassErrorPPM
ELKFVNAEEAKQLIAEEGYSVVDVR,nt,E,48,true,"HUNTER N-terminome: legumain, GluC and trypsin",119,31951383,"MaxQuant score",238.6900000,,,,,,
ELKFVNAEE,nt,E,48,true,"HUNTER N-terminome: legumain, GluC and trypsin",119,31951383,"MaxQuant score",134.5100000,,,,,,
FVNAEEAKQLIAEEGYSVVDVR,ac,K,58,true,"Histone deacetylases - hda14 vs WT (thylakoids)",98d,29061669,"MaxQuant Score",64.6000000,1.0000000,-0.0020000,0.9977001,NO,1.5399999497845E-8,
DKTQFER,ac,K,74,true,"Quantitative Acetylproteomics",101,29440448,,,,,,,,
VNPEFLKSVR,ac,K,129,true,"Histone deacetylases - apicidin vs control",98a,29061669,"MaxQuant Score",120.1000000,1.0000000,-0.0420000,0.8035261,NO,8.4999998151147E-9,
VNPEFLKSVR,ac,K,129,true,"Histone deacetylases substrates - hda14 vs WT",98e,29061669,"MaxQuant Score",66.3000000,1.0000000,0.0550000,0.9289664,NO,0.0020000000949949,
VNPEFLKSVR,ac,K,129,true,"Quantitative Acetylproteomics",101,29440448,,,,,,,,
NEFSQDSK,ph,S,136,true,"atm and atr DNA damage response",88,25561503,"MASCOT Score",39.0000000,1.0000000,,,,,-1.4500000
