Peptide,PTM,ModifiedAA,ModifiedPosition,PeptideUniqueToGene,ExperimentDesc,ExpID,PubmedID,ScoreType,IdentScore,LocProb,Log2FChange,PQ-val,QuantSig,PEP,MassErrorPPM
AMVQETVQGSPLVYAR,nta,A,49,true,"Arabidopsis translation initiation landscape - NTA",167a,35069635,,,,,,,,
MVQETVQGSPLVYAR,nt,M,50,true,"N-terminal ChaFRADIC",92,26010716,"MASCOT Score",36.8800000,,,,,1.3779999790131E-6,
MVQETVQGSPLVYAR,nt,M,50,true,"HUNTER N-terminome: legumain, GluC and trypsin",119,31951383,"MaxQuant score",106.0100000,,,,,,
VQETVQGSPLVYAR,nt,V,51,true,"N-terminal ChaFRADIC",92,26010716,"MASCOT Score",85.1100000,,,,,8.6529998952756E-6,
VQETVQGSPLVYAR,nt,V,51,true,"Stromal N-terminome",96,26371235,"MASCOT Score",120.2600000,,,,,,
VQETVQGSPLVYAR,nt,V,51,true,"HUNTER N-terminome: legumain, GluC and trypsin",119,31951383,"MaxQuant score",160.5200000,,,,,,
VQETVQGSPLVYAR,nt,V,51,true,"Arabidopsis translation initiation landscape - NT",167b,35069635,,,,,,,,
VQETVQGSPL,nt,V,51,true,"N-term acetylation drought responses",5,26184543,,,,,,,,
VQETVQGSPLVYAR,nta,V,51,true,"N-terminal ChaFRADIC",92,26010716,"MASCOT Score",85.1100000,,,,,8.6529998952756E-6,
VQETVQGSPLVYAR,nta,V,51,true,"Stromal N-terminome",96,26371235,"MASCOT Score",45.9300000,,,,,,
VQETVQGSPLVYAR,nta,V,51,true,"FtsH12 N-terminome: WT / FtsH12 knockdown miRNA",118,33216923,"MaxQuant score",184.3100000,,,,,1.4900000044649E-23,
VQETVQGSPLVYAR,nta,V,51,true,"HUNTER N-terminome: legumain, GluC and trypsin",119,31951383,"MaxQuant score",136.7000000,,,,,,
VQETVQGSPLVYAR,nta,V,51,true,"Arabidopsis translation initiation landscape - NTA",167a,35069635,,,,,,,,
VQETVQGSPLVY,nta,V,51,true,"Characterization plant N-terminal acetylation",6,22223895,"MASCOT Score",63.7700000,,,,,,
VQETVQGSPL,nta,V,51,true,"N-term acetylation drought responses",5,26184543,,,,,,,,
VQETVQGSPLVYAR,ph,S,58,true,"Tissue atlas Arabidopsis - ProteomicsDB",114,32188942,"MaxQuant score",189.5200000,1.0000000,,,,5.5134800147151E-25,
LNPTPRPTTSPCFEGR,acy,C,122,true,"Arabidopsis S-acylation atlas - Meristem",163a,35681017,,,,,,,,
LNPTPRPTTSPCFEGR,acy,C,122,true,"Arabidopsis S-acylation atlas - Silique",163e,35681017,,,,,,,,
