Peptide,PTM,ModifiedAA,ModifiedPosition,PeptideUniqueToGene,ExperimentDesc,ExpID,PubmedID,ScoreType,IdentScore,LocProb,Log2FChange,PQ-val,QuantSig,PEP,MassErrorPPM
PGDLYGYPNSSFPSNSHLPQLGR,ph,S,225,true,"Tissue atlas Arabidopsis - ProteomicsDB",114,32188942,"MaxQuant score",149.0400000,0.8375620,,,,2.8747299800647E-34,
PGDLYGYPNSSFPSNSHLPQLGR,ph,S,228,true,"Tissue atlas Arabidopsis - ProteomicsDB",114,32188942,"MaxQuant score",152.2700000,0.9689880,,,,4.0705601535675E-34,
VDSSSSYYASTESPHSADMQMTLFGK,ph,S,240,true,"Arabidopsis root NAA phosphoproteome",18a,27643528,"MaxQuant Score",66.8280000,0.9140000,,,,3.3199999052158E-6,-2.7710000
VDSSSSYYASTESPHSADMQMTLFGK,ph,S,240,true,"TOR Kinase and ABA Receptor",100,29290610,XCorr,4.1742105,0.9651000,,,,2.3739999051031E-6,
VDSSSSYYASTESPHSADMQMTLFGK,ph,S,240,true,"Tissue atlas Arabidopsis - ProteomicsDB",114,32188942,"MaxQuant score",242.4800000,0.9953400,,,,0,
VDSSSSYYASTESPHSADMQMTLFGK,ph,S,250,true,"Tissue atlas Arabidopsis - ProteomicsDB",114,32188942,"MaxQuant score",251.3300000,0.9919010,,,,0,
EMVDGIDNSGTGSPSNANTPQALSR,ph,S,912,true,"atm and atr DNA damage response",88,25561503,"MASCOT Score",71.0000000,0.9290000,,,,,1.2500000
EMVDGIDNSGTGSPSNANTPQALSR,ph,S,912,true,"TOR Kinase and ABA Receptor",100,29290610,XCorr,4.3010998,0.7960000,,,,7.0290002440743E-7,
EMVDGIDNSGTGSPSNANTPQALSR,ph,S,912,true,"Phospho cell culture sucrose/TOR",109,30833711,,,0.9930490,,,,,
