Peptide,PTM,ModifiedAA,ModifiedPosition,PeptideUniqueToGene,ExperimentDesc,ExpID,PubmedID,ScoreType,IdentScore,LocProb,Log2FChange,PQ-val,QuantSig,PEP,MassErrorPPM
ILTNANDSGRK,ph,S,231,true,"atm and atr DNA damage response",88,25561503,"MASCOT Score",32.0000000,1.0000000,,,,,-1.0200000
ILTNANDSGRK,ph,S,231,true,"TOR Kinase and ABA Receptor",100,29290610,XCorr,3.6310575,0.9997000,,,,0.037000000476837,
ILTNANDSGRK,ph,S,231,true,"Tissue atlas Arabidopsis - ProteomicsDB",114,32188942,"MaxQuant score",179.4300000,1.0000000,,,,4.2129301214061E-14,
SLSRTASVFSSSAALFEK,ph,S,543,true,"TOR Kinase and ABA Receptor",100,29290610,XCorr,3.7726283,0.8174000,,,,0.0020890000741929,
SLSRTASVFSSSAALFEK,ph,S,549,true,"Brassinosteroid-Regulated Phosphorylation Dynamics",94,26187819,"MaxQuant Score",134.8500000,0.9980000,,,,4.1309999865291E-10,-0.5960000
SLSRTASVFSSSAALFEK,ph,S,549,true,"TOR Kinase and ABA Receptor",100,29290610,XCorr,3.7726283,0.9968000,,,,0.0020890000741929,
TASVFSSSAALFEK,ph,S,549,true,"Phosphorylation Early Elicitor Signaling",23,17317660,,,,,,,,
TASVFSSSAALFEK,ph,S,549,true,"atm and atr DNA damage response",88,25561503,"MASCOT Score",28.0000000,0.9940000,,,,,-1.2300000
TASVFSSSAALFEK,ph,S,549,true,"TOR Kinase and ABA Receptor",100,29290610,XCorr,4.2005363,0.9218000,,,,5.4850002015883E-6,
TASVFSSSAALFEK,ph,S,549,true,"Phospho cell culture sucrose/TOR",109,30833711,,,0.9836700,,,,,
TASVFSSSAALFEK,ph,S,549,true,"Tissue atlas Arabidopsis - ProteomicsDB",114,32188942,"MaxQuant score",220.8500000,0.9999960,,,,0,
TYQIDSGDVKPR,ph,S,846,true,"Tissue atlas Arabidopsis - ProteomicsDB",114,32188942,"MaxQuant score",43.5920000,0.9996020,,,,0.017822099849582,
EFDMKSPR,ph,S,985,true,"Tissue atlas Arabidopsis - ProteomicsDB",114,32188942,"MaxQuant score",118.2800000,1.0000000,,,,0.0055961101315916,
