Peptide,PTM,ModifiedAA,ModifiedPosition,PeptideUniqueToGene,ExperimentDesc,ExpID,PubmedID,ScoreType,IdentScore,LocProb,Log2FChange,PQ-val,QuantSig,PEP,MassErrorPPM
QLSDEATLVAINR,nt,Q,24,true,"HUNTER N-terminome: legumain, GluC and trypsin",119,31951383,"MaxQuant score",134.4900000,,,,,,
ELGVPGWSSNGTDYCTWVGLK,ng,N,46,true,"Conserved N-glycosylation",74,22633491,"MaxQuant Score",138.6300000,1.0000000,,,,3.6060000054164E-28,1.5480000
GNVTLISDLR,ng,N,78,true,"Conserved N-glycosylation",74,22633491,"MaxQuant Score",109.2100000,1.0000000,,,,6.6669999796432E-5,0.7730000
AFNISNNLLVGEIPDELK,ng,N,140,true,"Conserved N-glycosylation",74,22633491,"MaxQuant Score",157.6300000,0.9810000,,,,2.4720025949461E-40,0.7780000
GDIPHEIGNCVK,sno,C,397,true,"hot5-4 / wildtype, FAT-switch S-nitrosoproteome",169,37277371,,,,,,,,
SPNSSFLGNK,ng,N,498,true,"Conserved N-glycosylation",74,22633491,"MaxQuant Score",144.9900000,1.0000000,,,,6.3329999022699E-8,-1.4590000
SPNSSFLGNK,ng,N,498,true,"N-linked Glycan Micro-heterogeneity Arabidopsis",134,29237727,,,,,,,,
SPNSSFLGNK,ng,N,498,true,"UDP-GlcNAc transporter glycopeptide analysis",135,30224661,,,,,,,3.8833921280457E-5,0.5000000
