Peptide,PTM,ModifiedAA,ModifiedPosition,PeptideUniqueToGene,ExperimentDesc,ExpID,PubmedID,ScoreType,IdentScore,LocProb,Log2FChange,PQ-val,QuantSig,PEP,MassErrorPPM
AVEKSNTTVGGVEILKPRTDNREY,nt,A,2,true,"Arabidopsis translation initiation landscape - NT",167b,35069635,,,,,,,,
AVEKSNTTVGGVEILKPR,nt,A,2,true,"Arg/N-end rule pathway Roots",80,25728785,"MASCOT Score",69.9400000,,,,,5.3130000399193E-12,
AVEKSNTTVGGVEILKPR,nt,A,2,true,"N-terminal ChaFRADIC",92,26010716,"MASCOT Score",37.2600000,,,,,3.2460001353485E-10,
AVEKSNTTVGGVEILKPR,nt,A,2,true,"Stromal N-terminome",96,26371235,"MASCOT Score",48.3900000,,,,,,
AVEKSNTTVGGVEILKPR,nt,A,2,true,"HUNTER N-terminome: legumain, GluC and trypsin",119,31951383,"MaxQuant score",85.4960000,,,,,,
AVEKSNTTVGGVE,nt,A,2,true,"N-terminal ChaFRADIC",92,26010716,"MASCOT Score",38.2100000,,,,,0.0025549998972565,
AVEKSNTTVGGVEILKPR,nta,A,2,true,"Arg/N-end rule pathway Roots",80,25728785,"MASCOT Score",56.6100000,,,,,2.8529999696048E-8,
AVEKSNTTVGGVEILKPR,nta,A,2,true,"N-terminal ChaFRADIC",92,26010716,"MASCOT Score",37.2600000,,,,,3.2460001353485E-10,
AVEKSNTTVGGVEILKPR,nta,A,2,true,"Stromal N-terminome",96,26371235,"MASCOT Score",48.3900000,,,,,,
AVEKSNTTVGGVE,nta,A,2,true,"N-terminal ChaFRADIC",92,26010716,"MASCOT Score",38.2100000,,,,,0.0025549998972565,
SNTTVGGVEILKPR,ph,S,6,true,"Tissue atlas Arabidopsis - ProteomicsDB",114,32188942,"MaxQuant score",156.1100000,0.9611540,,,,4.2942099875987E-10,
SNTTVGGVEILKPR,ng,N,7,true,"Conserved N-glycosylation",74,22633491,"MaxQuant Score",75.4170000,1.0000000,,,,0.0020000000949949,-0.1900000
SNTTVGGVEILKPR,ph,T,8,true,"Tissue atlas Arabidopsis - ProteomicsDB",114,32188942,"MaxQuant score",143.3500000,0.9860210,,,,3.2699299955891E-17,
FDEALDR,nt,F,119,true,"Arg/N-end rule seed, prt6 vs. Wt",99,29168982,"MASCOT Score",51.0000000,,-0.4564042,0.0110892,NO,0.16050000488758,-1.5271085
ESLDKIQDLVER,ub,K,227,true,"upl3 mutant / wildtype",168,35926874,"MaxQuant score",109.4400000,1.0000000,0.1492594,0.8708600,NO,0.0001238969998667,-0.1831500
FPGQPCTADHLQILVK,so,C,254,true,"S-sulfenylation site detection using YAP1C",110,32714340,,,,,,,,
HIEDVLFNDPKPICR,so,C,717,true,"Arabidopsis S-sulfenylation chemoproteomics",108,31578252,"pFind PSM Score",0.0045130,,1.4492800,,,,-1.0979906
VESLLKNFESK,ac,K,833,true,"Quantitative Acetylproteomics",101,29440448,,,,,,,,
LYEMSNEDFKSNVTALIDMK,ph,S,843,true,"Brassinosteroid-Regulated Phosphorylation Dynamics",94,26187819,"MaxQuant Score",80.4120000,0.9700000,,,,0.013000000268221,-2.9380000
LYEMSNEDFKSNVTALIDMK,ph,S,849,true,"Brassinosteroid-Regulated Phosphorylation Dynamics",94,26187819,"MaxQuant Score",80.4120000,0.9250000,,,,0.013000000268221,-2.5270000
LYEMSNEDFKSNVTALIDMK,ph,T,852,true,"Brassinosteroid-Regulated Phosphorylation Dynamics",94,26187819,"MaxQuant Score",80.4120000,1.0000000,,,,0.013000000268221,-2.5270000
EMASDKDEVPSPSVEIEDIVGFR,ph,S,941,true,"SnRK2 protein kinase substrates",85,23776212,XCorr,3.2612109,0.9120000,,,,1.3844800150764E-7,
GCGQPK,sno,C,965,true,"hot5-4 / wildtype, FAT-switch S-nitrosoproteome",169,37277371,,,,,,,,
