Peptide,PTM,ModifiedAA,ModifiedPosition,PeptideUniqueToGene,ExperimentDesc,ExpID,PubmedID,ScoreType,IdentScore,LocProb,Log2FChange,PQ-val,QuantSig,PEP,MassErrorPPM
SGVTSEPIAMDATR,nt,S,2,true,"Arg/N-end rule seed, prt6 vs. Wt",99,29168982,"MASCOT Score",76.6300000,,,,,0.014349999837577,-1.7237036
SGVTSEPIAMDATR,nt,S,2,true,"FtsH12 N-terminome: WT / FtsH12 knockdown miRNA",118,33216923,"MaxQuant score",75.1770000,,0.4213403,0.0250336,NO,6.3500003477657E-8,
SGVTSEPIAM,nt,S,2,true,"N-term acetylation drought responses",5,26184543,,,,,,,,
SGVTSEPIAMDATRF,nta,S,2,true,"Arabidopsis translation initiation landscape - NTA",167a,35069635,,,,,,,,
SGVTSEPIAMDATR,nta,S,2,true,"Characterization plant N-terminal acetylation",6,22223895,"MASCOT Score",71.8900000,,,,,,
SGVTSEPIAMDATR,nta,S,2,true,"Arg/N-end rule seed, prt6 vs. Wt",99,29168982,"MASCOT Score",76.6300000,,,,,0.014349999837577,-1.7237036
SGVTSEPIAMDATR,nta,S,2,true,"HUNTER N-terminome: legumain, GluC and trypsin",119,31951383,"MaxQuant score",107.1100000,,,,,,
SGVTSEPIAM,nta,S,2,true,"N-term acetylation drought responses",5,26184543,,,,,,,,
