Peptide,PTM,ModifiedAA,ModifiedPosition,PeptideUniqueToGene,ExperimentDesc,ExpID,PubmedID,ScoreType,IdentScore,LocProb,Log2FChange,PQ-val,QuantSig,PEP,MassErrorPPM
SNLLRDFEVEAKNPSLEAR,nt,S,2,true,"N-terminal ChaFRADIC",92,26010716,"MASCOT Score",24.5600000,,,,,5.2209998102626E-6,
SNLLRDFEVEAKNPSLEAR,nta,S,2,true,"N-terminal ChaFRADIC",92,26010716,"MASCOT Score",24.5600000,,,,,5.2209998102626E-6,
DFEVEAKNPSLEAR,nt,D,7,true,"Metacaspase9 substrates - Col-0 / mc9",51a,23964026,"MASCOT Score",52.0000000,,1.1405174,,NO,,-2.6828025
NPSLEAR,ph,S,16,false,"Tissue atlas Arabidopsis - ProteomicsDB",114,32188942,"MaxQuant score",161.3500000,1.0000000,,,,2.8166899368465E-11,
SSVSIVKNR,ph,S,28,true,"STN8 phosphoproteome",38,21768351,"MASCOT Score",44.1600000,,,,,,-1.0596300
SSVSIVKNR,ph,S,28,true,"Chloroplast kinase substrates",60,19376835,"MASCOT Score",44.5700000,,,,,,-1.0596300
SSVSIVK,ph,S,28,true,"STN8 phosphoproteome",38,21768351,"MASCOT Score",65.2800000,,,,,,-0.6901300
SSVSIVK,ph,S,28,true,"TOR Kinase and ABA Receptor",100,29290610,XCorr,2.8855150,1.0000000,,,,0.009095000103116,
SSVSIVKNR,ac,K,31,true,"Quantitative Acetylproteomics",101,29440448,,,,,,,,
VAFFVQKAALHFIDAAARPEYK,ub,K,68,true,"upl3 mutant / wildtype",168,35926874,"MaxQuant score",124.0800000,1.0000000,-0.9023892,0.2796400,NO,1.8511399489452E-16,-0.1443400
LTDEVKK,ub,K,89,false,"Ubiquitination Membrane Proteins",120,33585938,,,,,,,,
SLAQKGGVEELAK,ub,K,115,true,"Ubiquitination Membrane Proteins",120,33585938,,,,,,,,
GGVEELAKK,ub,K,123,true,"Ubiquitination Membrane Proteins",120,33585938,,,,,,,,
DKDGNTQILGSPTER,ph,S,520,true,"Tissue atlas Arabidopsis - ProteomicsDB",114,32188942,"MaxQuant score",109.1300000,0.9894900,,,,1.1215800441278E-5,
TQILGSPTER,ph,S,520,false,"Tissue atlas Arabidopsis - ProteomicsDB",114,32188942,"MaxQuant score",99.5390000,0.8575790,,,,0.00044613299542107,
ILKIEPFNSDK,ac,K,548,false,"Quantitative Acetylproteomics",101,29440448,,,,,,,,
EAVQTCQAAGITVR,sno,C,664,false,"hot5-4 / wildtype, FAT-switch S-nitrosoproteome",169,37277371,,,,,,,,
TASFITKTMWR,ac,K,878,true,"Quantitative Acetylproteomics",101,29440448,,,,,,,,
CVPVESR,sno,C,1005,true,"hot5-4 / wildtype, FAT-switch S-nitrosoproteome",169,37277371,,,,,,,,
