Peptide,PTM,ModifiedAA,ModifiedPosition,PeptideUniqueToGene,ExperimentDesc,ExpID,PubmedID,ScoreType,IdentScore,LocProb,Log2FChange,PQ-val,QuantSig,PEP,MassErrorPPM
ASGLSEIGSTKMFDGYNKR,nt,A,2,true,"Stromal N-terminome",96,26371235,"MASCOT Score",54.2500000,,,,,,
ASGLSEIGSTKMFDGYN,nt,A,2,true,"Arg/N-end rule seed, prt6 vs. Wt",99,29168982,"MASCOT Score",25.1800000,,,,,0.1494999974966,2.4810927
ASGLSEIGSTKMFDGY,nt,A,2,true,"Arg/N-end rule seed, prt6 vs. Wt",99,29168982,"MASCOT Score",53.0900000,,,,,0.00054099998669699,-2.5053527
ASGLSEIGSTKMF,nt,A,2,true,"Arg/N-end rule seed, prt6 vs. Wt",99,29168982,"MASCOT Score",41.2700000,,,,,0.0075530000030994,-5.3687736
ASGLSEIGSTK,nt,A,2,true,"Arg/N-end rule seed, prt6 vs. Wt",99,29168982,"MASCOT Score",34.5100000,,,,,0.11770000308752,-2.4997050
ASGLSEIGST,nt,A,2,true,"N-term acetylation drought responses",5,26184543,,,,,,,,
ASGLSEIGSTKMFDGYNKR,nta,A,2,true,"Arg/N-end rule pathway Roots",80,25728785,"MASCOT Score",34.0400000,,,,,0.0090370001271367,
ASGLSEIGSTKMFDGYNKR,nta,A,2,true,"Stromal N-terminome",96,26371235,"MASCOT Score",54.2500000,,,,,,
ASGLSEIGSTKMFDGYNKR,nta,A,2,true,"FtsH12 N-terminome: WT / FtsH12 knockdown miRNA",118,33216923,"MaxQuant score",82.4490000,,,,,9.9899996712338E-5,
ASGLSEIGSTKMFDGYNKR,nta,A,2,true,"HUNTER N-terminome: legumain, GluC and trypsin",119,31951383,"MaxQuant score",47.7520000,,,,,,
ASGLSEIGSTKMFDGYNKR,nta,A,2,true,"Arabidopsis translation initiation landscape - NTA",167a,35069635,,,,,,,,
ASGLSEIGSTKMFDGYN,nta,A,2,true,"Arg/N-end rule seed, prt6 vs. Wt",99,29168982,"MASCOT Score",25.1800000,,0.7500455,0.2666524,NO,0.1494999974966,2.4810927
ASGLSEIGSTKMFDGYN,nta,A,2,true,"HUNTER N-terminome: legumain, GluC and trypsin",119,31951383,"MaxQuant score",130.6900000,,,,,,
ASGLSEIGSTKMFDGY,nta,A,2,true,"Arg/N-end rule seed, prt6 vs. Wt",99,29168982,"MASCOT Score",53.0900000,,-0.4611048,0.3355100,NO,0.00054099998669699,-2.5053527
ASGLSEIGSTKMFD,nta,A,2,true,"HUNTER N-terminome: legumain, GluC and trypsin",119,31951383,"MaxQuant score",52.9280000,,,,,,
ASGLSEIGSTKMF,nta,A,2,true,"Arg/N-end rule seed, prt6 vs. Wt",99,29168982,"MASCOT Score",41.2700000,,-0.1710803,0.7377025,NO,0.0075530000030994,-5.3687736
ASGLSEIGSTK,nta,A,2,true,"Characterization plant N-terminal acetylation",6,22223895,"MASCOT Score",93.1200000,,,,,,
ASGLSEIGSTK,nta,A,2,true,"Arg/N-end rule seed, prt6 vs. Wt",99,29168982,"MASCOT Score",34.5100000,,-0.2001822,0.7025941,NO,0.11770000308752,-2.4997050
ASGLSEIGST,nta,A,2,true,"N-term acetylation drought responses",5,26184543,,,,,,,,
MFDGYNKR,ac,K,19,true,"Quantitative Acetylproteomics",101,29440448,,,,,,,,
AASTHGIALVAPDTSPR,ph,T,86,true,"Tissue atlas Arabidopsis - ProteomicsDB",114,32188942,"MaxQuant score",169.4300000,0.7857000,,,,1.1478800102631E-21,
AASTHGIALVAPDTSPR,ph,S,87,true,"atm and atr DNA damage response",88,25561503,"MASCOT Score",51.0000000,0.9530000,,,,,-0.6200000
AASTHGIALVAPDTSPR,ph,S,87,true,"Tissue atlas Arabidopsis - ProteomicsDB",114,32188942,"MaxQuant score",178.2300000,0.8505860,,,,1.3934300254534E-29,
SVSAFAPITNPINCAWGQK,sno,C,184,true,"Site-specific nitrosomeproteomic id - gsnor1-3",90a,25699590,XCorr,2.1500000,,,,,0.083700001239777,-7.4100000
SVSAFAPITNPINCAWGQK,sno,C,184,true,"Site-specific nitrosomeproteomic id - gsnor1-3",90b,25699590,XCorr,2.2600000,,,,,0.00070610002148896,-7.4100000
AAWEEYDATCLISK,acy,C,209,true,"Arabidopsis S-acylation atlas - Meristem",163a,35681017,,,,,,,,
AAWEEYDATCLISK,sno,C,209,true,"Site-specific nitrosomeproteomic id - gsnor1-3",90a,25699590,XCorr,4.1995668,,,,,1.6290000530716E-6,-6.0312908
AAWEEYDATCLISK,sno,C,209,true,"Site-specific nitrosomeproteomic id - gsnor1-3",90b,25699590,XCorr,4.0800000,,,,,0.02508999966085,-6.7500000
AAWEEYDATCLISK,so,C,209,true,"Arabidopsis S-sulfenylation chemoproteomics",108,31578252,"pFind PSM Score",0.2122310,,,,,,0.0822651
AAWEEYDATCLISK,so,C,209,true,"S-sulfenylation site detection using YAP1C",110,32714340,,,,,,,,
FEEACK,so,C,245,true,"Arabidopsis S-sulfenylation chemoproteomics",108,31578252,"pFind PSM Score",0.1483210,,1.4449100,,,,0.4467761
