Peptide,PTM,ModifiedAA,ModifiedPosition,PeptideUniqueToGene,ExperimentDesc,ExpID,PubmedID,ScoreType,IdentScore,LocProb,Log2FChange,PQ-val,QuantSig,PEP,MassErrorPPM
MKLAASLNR,nta,M,1,true,"Arabidopsis translation initiation landscape - NTA",167a,35069635,,,,,,,,
LAASLNRLSPK,ph,S,6,true,"atm and atr DNA damage response",88,25561503,"MASCOT Score",22.0000000,1.0000000,,,,,-1.7900000
LAASLNRLSPK,ph,S,6,true,"Tissue atlas Arabidopsis - ProteomicsDB",114,32188942,"MaxQuant score",107.6900000,1.0000000,,,,0.00047308800276369,
LAASLNRLSPK,ph,S,11,true,"Phosphorylation Early Elicitor Signaling",23,17317660,,,,,,,,
LAASLNRLSPK,ph,S,11,true,"STN8 phosphoproteome",38,21768351,"MASCOT Score",52.4200000,,,,,,-0.7439050
LAASLNRLSPK,ph,S,11,true,"MAPK Arabidopsis substrates",45,23172892,"MaxQuant Score",165.6300000,,,,,,
LAASLNRLSPK,ph,S,11,true,"Chloroplast kinase substrates",60,19376835,"MASCOT Score",35.9900000,,,,,,-0.4880430
LAASLNRLSPK,ph,S,11,true,"atm and atr DNA damage response",88,25561503,"MASCOT Score",54.0000000,1.0000000,,,,,-1.3900000
LAASLNRLSPK,ph,S,11,true,"TOR Kinase and ABA Receptor",100,29290610,XCorr,2.8260455,0.9994000,,,,0.0069349999539554,
LAASLNRLSPK,ph,S,11,true,"Phosphorylation tonoplast membrane fraction",107,18686298,"MASCOT Score",51.0000000,,,,,,
LAASLNRLSPK,ph,S,11,true,"Phospho cell culture sucrose/TOR",109,30833711,,,0.9998920,,,,,
LAASLNRLSPK,ph,S,11,true,"Tissue atlas Arabidopsis - ProteomicsDB",114,32188942,"MaxQuant score",229.8900000,1.0000000,,,,8.8926400546053E-42,
SEPSSFSSNASSSSSDGSYGNLK,ph,S,31,true,"TOR Kinase and ABA Receptor",100,29290610,XCorr,4.0628695,0.8561000,,,,1.3840000292475E-6,
SEPSSFSSNASSSSSDGSYGNLK,ph,S,31,true,"Tissue atlas Arabidopsis - ProteomicsDB",114,32188942,"MaxQuant score",299.4700000,0.9969480,,,,0,
SEPSSFSSNASSSSSDGSYGNLK,ph,S,41,true,"Tissue atlas Arabidopsis - ProteomicsDB",114,32188942,"MaxQuant score",238.6300000,0.9568130,,,,0,
SEPSSFSSNASSSSSDGSYGNLK,ph,S,44,true,"Tissue atlas Arabidopsis - ProteomicsDB",114,32188942,"MaxQuant score",355.1600000,0.9999470,,,,0,
LIDRDDDGVVSR,ph,S,87,true,"atm and atr DNA damage response",88,25561503,"MASCOT Score",27.0000000,1.0000000,,,,,-0.3200000
