Peptide,PTM,ModifiedAA,ModifiedPosition,PeptideUniqueToGene,ExperimentDesc,ExpID,PubmedID,ScoreType,IdentScore,LocProb,Log2FChange,PQ-val,QuantSig,PEP,MassErrorPPM
CGVGFIANLENKATHKIVN,nt,C,108,true,"Arabidopsis translation initiation landscape - NT",167b,35069635,,,,,,,,
CGVGFIANLE,nt,C,108,true,"Arg/N-end rule seed, prt6 vs. Wt",99,29168982,"MASCOT Score",51.5600000,,0.2318917,0.5099938,NO,0.00060540001140907,-4.5269496
IVNDALIALGCMEHR,ox,C,134,true,"SPEAR - 50 mM H2O2 / mock",138b,34619326,,,,-0.7994819,0.0183872,YES,,
DALIALGCMEHR,ox,C,134,false,"SPEAR - 50 mM H2O2 / mock",138b,34619326,,,,1.9886573,0.0225888,YES,,
IVNDALIALGCMEHR,so,C,134,true,"S-sulfenylation site detection using YAP1C",110,32714340,,,,,,,,
FSTNTSPR,ph,T,321,true,"Lateral root-induction - NAA vs control",106,23328941,"MASCOT Score",21.0000000,,,,,,
FSTNTSPR,ph,T,323,true,"Lateral root-induction - NAA vs control",106,23328941,"MASCOT Score",33.0000000,,,,,,
FSTNTSPR,ph,S,324,true,"Phospho cell culture sucrose/TOR",109,30833711,,,0.8245030,,,,,
TVGACLDR,ox,C,455,false,"OxiTRAQ Arabidopsis - 5 mM H2O2 versus control",47,24376095,,,,1.3124007,0.0012565,YES,,
TVGACLDR,sno,C,455,false,"hot5-4 / wildtype, FAT-switch S-nitrosoproteome",169,37277371,,,,,,,,
VASYNPYGKWVSENLR,ph,Y,524,true,"Large-scale phosphorylation discovery",44,23111157,XCorr,2.3100000,,,,,,
LCEAADEAVR,ox,C,698,true,"OxiTRAQ Arabidopsis - 5 mM H2O2 versus control",47,24376095,,,,1.2194290,0.0028312,NO,,
EAADEAVR,nt,E,699,true,"Arg/N-end rule seed, prt6 vs. Wt",99,29168982,"MASCOT Score",33.7500000,,-0.8102310,0.0338215,NO,0.16910000145435,-0.0415139
DLLEFKSDRNPIPVGK,ac,K,952,true,"Quantitative Acetylproteomics",101,29440448,,,,,,,,
DLLEFKSDR,ac,K,952,false,"Histone deacetylases substrates - TSA vs control",98b,29061669,"MaxQuant Score",82.4000000,1.0000000,-0.0180000,0.9977001,NO,0.003000000026077,
DLLEFKSDR,ac,K,952,false,"Histone deacetylases substrates - hda14 vs WT",98e,29061669,"MaxQuant Score",64.8000000,1.0000000,-0.0570000,0.9204496,NO,0.0060000000521541,
DLLEFKSDR,ac,K,952,false,"Quantitative Acetylproteomics",101,29440448,,,,,,,,
FCTGGMSLGAISR,so,C,974,false,"S-sulfenylation site detection using YAP1C",110,32714340,,,,,,,,
VAQGAKPGEGGQLPGKK,ac,K,1084,false,"Quantitative Acetylproteomics",101,29440448,,,,,,,,
TMSIYNVDR,ph,S,1373,true,"Tissue atlas Arabidopsis - ProteomicsDB",114,32188942,"MaxQuant score",78.3420000,0.9997840,,,,0.0052752001211047,
TTTGDEEQVSSTLAEK,ph,T,1625,true,"Tissue atlas Arabidopsis - ProteomicsDB",114,32188942,"MaxQuant score",88.1080000,0.7965160,,,,0.00044982301187702,
