Peptide,PTM,ModifiedAA,ModifiedPosition,PeptideUniqueToGene,ExperimentDesc,ExpID,PubmedID,ScoreType,IdentScore,LocProb,Log2FChange,PQ-val,QuantSig,PEP,MassErrorPPM
KTDVTFEDDEDNEDLEDNSSK,ph,S,29,true,"Tissue atlas Arabidopsis - ProteomicsDB",114,32188942,"MaxQuant score",108.7100000,0.8268480,,,,1.5765599546344E-12,
YENDSETDQSDLGDLPGDAVDR,ph,S,36,true,"Tissue atlas Arabidopsis - ProteomicsDB",114,32188942,"MaxQuant score",252.7500000,0.9990810,,,,0,
SNPPSFYR,ph,S,91,true,"Tissue atlas Arabidopsis - ProteomicsDB",114,32188942,"MaxQuant score",77.0620000,1.0000000,,,,0.0084501700475812,
SNPPSFYRASR,ph,S,95,true,"atm and atr DNA damage response",88,25561503,"MASCOT Score",20.0000000,0.9910000,,,,,0.9400000
SNPPSFYR,ph,S,95,true,"atm and atr DNA damage response",88,25561503,"MASCOT Score",31.0000000,1.0000000,,,,,-0.2800000
SNPPSFYR,ph,S,95,true,"Tissue atlas Arabidopsis - ProteomicsDB",114,32188942,"MaxQuant score",83.8690000,0.9996630,,,,0.0079670296981931,
SNPPSFYRASR,ph,S,100,true,"atm and atr DNA damage response",88,25561503,"MASCOT Score",20.0000000,1.0000000,,,,,0.9400000
ASRSNLDVESK,ph,S,100,true,"Tissue atlas Arabidopsis - ProteomicsDB",114,32188942,"MaxQuant score",96.1350000,0.9997070,,,,0.00020769500406459,
ASRSNLDVESK,ph,S,102,true,"Phospho cell culture sucrose/TOR",109,30833711,,,0.9438430,,,,,
SNLDVESK,ph,S,102,true,"Tissue atlas Arabidopsis - ProteomicsDB",114,32188942,"MaxQuant score",150.9000000,1.0000000,,,,2.681620081546E-8,
SNLDVESKAPLLPER,ph,S,108,true,"Tissue atlas Arabidopsis - ProteomicsDB",114,32188942,"MaxQuant score",122.9400000,0.9999990,,,,7.8028199368418E-7,
HDDSDKASATQSAWSHK,ph,S,120,true,"Tissue atlas Arabidopsis - ProteomicsDB",114,32188942,"MaxQuant score",112.2700000,0.9996830,,,,2.0640400499872E-9,
ASATQSAWSHK,ph,S,128,true,"Tissue atlas Arabidopsis - ProteomicsDB",114,32188942,"MaxQuant score",89.6240000,0.9696410,,,,0.00068228697637096,
ASATQSAWSHK,ph,S,131,true,"Tissue atlas Arabidopsis - ProteomicsDB",114,32188942,"MaxQuant score",120.9200000,0.9990840,,,,5.7838501561491E-6,
