Peptide,PTM,ModifiedAA,ModifiedPosition,PeptideUniqueToGene,ExperimentDesc,ExpID,PubmedID,ScoreType,IdentScore,LocProb,Log2FChange,PQ-val,QuantSig,PEP,MassErrorPPM
ADKLTDDQITEYRE,nt,A,2,true,"N-terminal ChaFRADIC",92,26010716,"MASCOT Score",44.3800000,,,,,0.00019690000044648,
ADKLTDDQITEYR,nt,A,2,true,"Arg/N-end rule seed, prt6 vs. Wt",99,29168982,"MASCOT Score",84.5600000,,,,,9.9129996669944E-5,-0.6385261
ADKLTDDQITEYR,nt,A,2,true,"FtsH12 N-terminome: WT / FtsH12 knockdown miRNA",118,33216923,"MaxQuant score",55.4690000,,0.5566282,0.0526585,NO,0.0034946999512613,
ADKLTDDQITE,nt,A,2,true,"N-terminal ChaFRADIC",92,26010716,"MASCOT Score",58.8200000,,,,,0.0081120003014803,
ADKLTDDQITE,nt,A,2,true,"Arg/N-end rule seed, prt6 vs. Wt",99,29168982,"MASCOT Score",60.9700000,,,,,0.0001988000003621,-0.1539336
ADKLTDDQIT,nt,A,2,true,"N-term acetylation drought responses",5,26184543,,,,,,,,
ADKLTDDQITEYRE,nta,A,2,true,"N-terminal ChaFRADIC",92,26010716,"MASCOT Score",44.3800000,,,,,0.00019690000044648,
ADKLTDDQITEYR,nta,A,2,true,"Arg/N-end rule seed, prt6 vs. Wt",99,29168982,"MASCOT Score",84.5600000,,-0.3425128,0.2768830,NO,9.9129996669944E-5,-0.6385261
ADKLTDDQITEYR,nta,A,2,true,"HUNTER N-terminome: legumain, GluC and trypsin",119,31951383,"MaxQuant score",44.7650000,,,,,,
ADKLTDDQITEYR,nta,A,2,true,"Arabidopsis translation initiation landscape - NTA",167a,35069635,,,,,,,,
ADKLTDDQITE,nta,A,2,true,"N-terminal ChaFRADIC",92,26010716,"MASCOT Score",58.8200000,,,,,0.0081120003014803,
ADKLTDDQITE,nta,A,2,true,"Arg/N-end rule seed, prt6 vs. Wt",99,29168982,"MASCOT Score",60.9700000,,-0.7639017,0.1165285,NO,0.0001988000003621,-0.1539336
ADKLTDDQITE,nta,A,2,true,"HUNTER N-terminome: legumain, GluC and trypsin",119,31951383,"MaxQuant score",101.3800000,,,,,,
ADKLTDDQIT,nta,A,2,true,"N-term acetylation drought responses",5,26184543,,,,,,,,
ADKLTDDQITEYR,ub,K,4,true,"Arabidopsis ubiquitination COFRADIC",40,26744219,"MaxQuant Score",131.3500000,1.0000000,,,,1.5330000384894E-14,0.5010000
LTDDQITEYRESFR,ph,S,16,true,"Phospho cell culture sucrose/TOR",109,30833711,,,0.9153090,,,,,
ADKLTDDQITEYRE,nt,A,91,true,"N-terminal ChaFRADIC",92,26010716,"MASCOT Score",44.3800000,,,,,0.00019690000044648,
ADKLTDDQITEYR,nt,A,91,true,"Arg/N-end rule seed, prt6 vs. Wt",99,29168982,"MASCOT Score",84.5600000,,,,,9.9129996669944E-5,-0.6385261
ADKLTDDQITEYR,nt,A,91,true,"FtsH12 N-terminome: WT / FtsH12 knockdown miRNA",118,33216923,"MaxQuant score",55.4690000,,0.5566282,0.0526585,NO,0.0034946999512613,
ADKLTDDQITE,nt,A,91,true,"N-terminal ChaFRADIC",92,26010716,"MASCOT Score",58.8200000,,,,,0.0081120003014803,
ADKLTDDQITE,nt,A,91,true,"Arg/N-end rule seed, prt6 vs. Wt",99,29168982,"MASCOT Score",60.9700000,,,,,0.0001988000003621,-0.1539336
ADKLTDDQIT,nt,A,91,true,"N-term acetylation drought responses",5,26184543,,,,,,,,
ADKLTDDQITEYRE,nta,A,91,true,"N-terminal ChaFRADIC",92,26010716,"MASCOT Score",44.3800000,,,,,0.00019690000044648,
ADKLTDDQITEYR,nta,A,91,true,"Arg/N-end rule seed, prt6 vs. Wt",99,29168982,"MASCOT Score",84.5600000,,-0.3425128,0.2768830,NO,9.9129996669944E-5,-0.6385261
ADKLTDDQITEYR,nta,A,91,true,"HUNTER N-terminome: legumain, GluC and trypsin",119,31951383,"MaxQuant score",44.7650000,,,,,,
ADKLTDDQITEYR,nta,A,91,true,"Arabidopsis translation initiation landscape - NTA",167a,35069635,,,,,,,,
ADKLTDDQITE,nta,A,91,true,"N-terminal ChaFRADIC",92,26010716,"MASCOT Score",58.8200000,,,,,0.0081120003014803,
ADKLTDDQITE,nta,A,91,true,"Arg/N-end rule seed, prt6 vs. Wt",99,29168982,"MASCOT Score",60.9700000,,-0.7639017,0.1165285,NO,0.0001988000003621,-0.1539336
ADKLTDDQITE,nta,A,91,true,"HUNTER N-terminome: legumain, GluC and trypsin",119,31951383,"MaxQuant score",101.3800000,,,,,,
ADKLTDDQIT,nta,A,91,true,"N-term acetylation drought responses",5,26184543,,,,,,,,
ADKLTDDQITEYR,ub,K,93,true,"Arabidopsis ubiquitination COFRADIC",40,26744219,"MaxQuant Score",131.3500000,1.0000000,,,,1.5330000384894E-14,0.5010000
LTDDQITEYRESFR,ph,S,105,true,"Phospho cell culture sucrose/TOR",109,30833711,,,0.9153090,,,,,
TVMFSLGK,ph,S,128,true,"Phospho cell culture sucrose/TOR",109,30833711,,,0.9997870,,,,,
