Peptide,PTM,ModifiedAA,ModifiedPosition,PeptideUniqueToGene,ExperimentDesc,ExpID,PubmedID,ScoreType,IdentScore,LocProb,Log2FChange,PQ-val,QuantSig,PEP,MassErrorPPM
MGSIRGNIEEPISQSLTR,ph,S,3,true,"srk2dei ABA signaling phopshoproteomics",83,23572148,"MASCOT Score",28.0000000,,,,,,-0.0021000
MGSIRGNIEEPISQSLTR,ph,S,13,true,"srk2dei ABA signaling phopshoproteomics",83,23572148,"MASCOT Score",28.0000000,,,,,,-0.0021000
MGSIRGNIEEPISQSLTR,ph,S,15,true,"srk2dei ABA signaling phopshoproteomics",83,23572148,"MASCOT Score",28.0000000,,,,,,-0.0021000
MGSIRGNIEEPISQSLTR,ph,T,17,true,"srk2dei ABA signaling phopshoproteomics",83,23572148,"MASCOT Score",28.0000000,,,,,,-0.0021000
GNIEEPISQSLTR,ph,T,17,true,"Tissue atlas Arabidopsis - ProteomicsDB",114,32188942,"MaxQuant score",173.0600000,0.8118640,,,,8.1474396660167E-15,
QNSLYSLK,ph,S,21,true,"Tissue atlas Arabidopsis - ProteomicsDB",114,32188942,"MaxQuant score",97.4560000,0.9999770,,,,0.0055474401451647,
QNSLYSLK,ph,S,24,true,"Tissue atlas Arabidopsis - ProteomicsDB",114,32188942,"MaxQuant score",74.9440000,0.9918460,,,,0.011229099705815,
LHEVQTHLGSSGKPLGSMNLDELLK,ph,S,43,true,"Tissue atlas Arabidopsis - ProteomicsDB",114,32188942,"MaxQuant score",148.6300000,0.9892790,,,,5.4650640108668E-44,
QGSLTLPR,ph,S,66,false,"ABA-induced protein phosphorylation",35,20733066,,,,,,,,
QGSLTLPR,ph,S,66,false,"Phosphoproteome ethylene-regulated time response",46,24043427,"MASCOT Score",47.2500000,,,,,,-22.9304000
QGSLTLPR,ph,S,66,false,"srk2dei ABA signaling phopshoproteomics",83,23572148,"MASCOT Score",49.0000000,,,,,,-0.0005000
QGSLTLPR,ph,S,66,false,"LAXIC - ABA stress",84a,23660473,XCorr,2.1200000,0.9950000,,,,0.004308819770813,
QGSLTLPR,ph,S,66,false,"LAXIC - mannitol vs control",84b,23660473,XCorr,2.3400000,0.9350000,,,,0.001663270057179,
QGSLTLPR,ph,S,66,false,"atm and atr DNA damage response",88,25561503,"MASCOT Score",47.0000000,0.9960000,,,,,-0.7700000
QGSLTLPR,ph,S,66,false,"TOR Kinase and ABA Receptor",100,29290610,XCorr,2.7452154,0.9101000,,,,0.0026700000744313,
QGSLTLPR,ph,S,66,false,"Col-0 callus - FC Col-0 vs. Col-0 Xray",111a,31410901,,29.4800000,,-0.7236115,0.0000000,NO,,0.1178629
QGSLTLPR,ph,S,66,false,"Col-0 X-ray callus - FC Col-0 vs. Col-0 Xray",111b,31410901,,29.4800000,,-0.7236115,0.0000000,NO,,0.1178629
QGSLTLPR,ph,S,66,false,"atm callus - FC atm vs. atm Xray",111c,31410901,,29.4800000,,-0.0335836,0.0000000,NO,,0.1178629
QGSLTLPR,ph,S,66,false,"atm-3 X-ray callus - FC atm vs. atm Xray",111d,31410901,,29.4800000,,-0.0335836,0.0000000,NO,,0.1178629
QGSLTLPR,ph,S,66,false,"Tissue atlas Arabidopsis - ProteomicsDB",114,32188942,"MaxQuant score",183.2200000,1.0000000,,,,9.4484503279091E-6,
QGSLTLPR,ph,T,68,false,"Tyrosine phosphorylation in Arabidopsis",59,18463617,"MASCOT Score",22.0000000,,,,,,-1.6834006
QGSLTLPR,ph,T,68,false,"srk2dei ABA signaling phopshoproteomics",83,23572148,"MASCOT Score",26.0000000,,,,,,0.0005000
QGSLTLPR,ph,T,68,false,"SnRK2 protein kinase substrates",85,23776212,XCorr,2.2104070,0.9990000,,,,0.0014614500105381,
