Peptide,PTM,ModifiedAA,ModifiedPosition,PeptideUniqueToGene,ExperimentDesc,ExpID,PubmedID,ScoreType,IdentScore,LocProb,Log2FChange,PQ-val,QuantSig,PEP,MassErrorPPM
MMNLGSLSLSTSK,nta,M,1,true,"Characterization plant N-terminal acetylation",6,22223895,"MASCOT Score",100.3900000,,,,,,
SVLRSEFGMK,mox,M,98,true,"cat2 Methionine oxidation - 3h stress",62b,25693801,"MASCOT Score",48.0000000,,-0.8158535,,NO,,
ADFPIKYR,ac,K,222,true,"Quantitative Acetylproteomics",101,29440448,,,,,,,,
VQKEDSIGFESGGNR,ub,K,230,true,"upl3 mutant / wildtype",168,35926874,"MaxQuant score",58.0790000,1.0000000,-0.1360615,,,0.00054164102766663,-0.3107500
VQKEDSIGFESGGNR,ph,S,233,true,"Tissue atlas Arabidopsis - ProteomicsDB",114,32188942,"MaxQuant score",94.6390000,0.9967820,,,,7.4784598837141E-5,
LPEDIKEEIQKAK,ub,K,361,true,"upl3 mutant / wildtype",168,35926874,"MaxQuant score",79.8750000,1.0000000,-0.8365013,,,0.0001452930009691,0.6300400
MPSESDVK,ph,S,786,true,"atm and atr DNA damage response",88,25561503,"MASCOT Score",22.0000000,1.0000000,,,,,-3.0200000
STIKNLVSSSGR,ac,K,919,true,"Quantitative Acetylproteomics",101,29440448,,,,,,,,
SVPANVSGEDINKSR,nt,S,928,true,"Metacaspase9 substrates - in vitro rMC9",51c,23964026,"MASCOT Score",52.0000000,,2.7299422,,NO,,-0.5257393
SVPANVSGEDINKSR,ac,K,940,true,"Quantitative Acetylproteomics",101,29440448,,,,,,,,
SVPANVSGEDINKSR,ub,K,940,true,"Arabidopsis ubiquitination COFRADIC",40,26744219,"MaxQuant Score",42.3140000,1.0000000,,,,0.0010000000474975,-1.2240000
SVPANVSGEDINKSR,ub,K,940,true,"upl3 mutant / wildtype",168,35926874,"MaxQuant score",103.7900000,1.0000000,-0.9406447,0.6041600,NO,8.6141298538678E-8,0.1143000
