Peptide,PTM,ModifiedAA,ModifiedPosition,PeptideUniqueToGene,ExperimentDesc,ExpID,PubmedID,ScoreType,IdentScore,LocProb,Log2FChange,PQ-val,QuantSig,PEP,MassErrorPPM
MLSSPPPPHSHSPF,nta,M,18,true,"Arabidopsis translation initiation landscape - NTA",167a,35069635,,,,,,,,
LSSSPSSSLK,ph,S,61,true,"Tissue atlas Arabidopsis - ProteomicsDB",114,32188942,"MaxQuant score",125.7400000,0.7852720,,,,8.3196900959592E-5,
LSSSPSSSLK,ph,S,62,true,"atm and atr DNA damage response",88,25561503,"MASCOT Score",41.0000000,0.9830000,,,,,0.4300000
LSSSPSSSLK,ph,S,62,true,"Tissue atlas Arabidopsis - ProteomicsDB",114,32188942,"MaxQuant score",113.3800000,0.9352590,,,,0.00019764200260397,
STVACSNAGAIR,ox,C,73,true,"OxiTRAQ Arabidopsis - 5 mM H2O2 versus control",47,24376095,,,,0.3033304,0.0508556,NO,,
ATVSQAFSER,nt,A,84,true,"Mitochondrial intermediate peptidases - icp55 / WT",131a,25732537,,46.8000000,,-0.2399307,,,,
ATVSQAFSER,nt,A,84,true,"Mitochondrial intermediate peptidases - oct1-1 / WT",131b,25732537,,83.9800000,,-0.2450955,,,,
ATVSQAFSER,nt,A,84,true,"Mitochondrial intermediate peptidases - oct1-2 / WT",131c,25732537,,57.1300000,,-0.0893770,,,,
ATVSQAFSER,nta,A,84,true,"Arabidopsis translation initiation landscape - NTA",167a,35069635,,,,,,,,
GAVDPCTTAFR,sno,C,272,true,"hot5-4 / wildtype, FAT-switch S-nitrosoproteome",169,37277371,,,,0.5210770,0.1708322,NO,,
GAVDPCTTAFR,so,C,272,true,"S-sulfenylation site detection using YAP1C",110,32714340,,,,,,,,
GRRPATKPDSPR,ph,S,461,true,"TOR Kinase and ABA Receptor",100,29290610,XCorr,2.2409809,0.9998000,,,,0.0011439999798313,
RPATKPDSPR,ph,S,461,true,"Chloroplast kinase substrates",60,19376835,"MASCOT Score",36.0500000,,,,,,-0.9397610
RPATKPDSPR,ph,S,461,true,"atm and atr DNA damage response",88,25561503,"MASCOT Score",28.0000000,1.0000000,,,,,-2.9100000
RPATKPDSPR,ph,S,461,true,"Tissue atlas Arabidopsis - ProteomicsDB",114,32188942,"MaxQuant score",85.4500000,0.9994450,,,,0.00064900802681223,
